{"text_format":"1","workbook":"xlsx","n_sheets":20,"sheets":["PROCESSUS TYPIQUE","1. IDENTITÉ","2009-2010","2010-2011","2011-2012","2012-2013","2013-2014","2014-2015","2015-2016","2016-2017","2017-2018","2018-2019","2019-2020","2020-2021","DJ 18 MTL","RÉSUMÉ","ListeMO","Transition","Conversion","Validation"],"not_rendered":{"charts":0,"images":3,"macros":1,"external_links":1,"defined_names":795,"comments":16,"pivot_tables":0},"unopened":[],"bounds":{"document_bytes":16777216,"sheet_cells":100000,"rows_first":2000,"rows_last":500,"rows_between":2000,"halvings":0,"cell_chars":16384,"cell_head_chars":4096},"cells_cut":0,"cells_raw":0,"read":"whole","date_system":"1900"}

{"sheet":"PROCESSUS TYPIQUE","index":0,"n_rows":18,"n_cols":4,"rows_kept":18,"cut":false,"hidden":false,"merged":[[1,1,1,3],[17,1,17,3]]}
[]
[null,"PROCESSUS DE COLLECTE DE DONNÉES ÉNERGÉTIQUES POUR LES BÂTIMENTS"]
[null,"Affirmation","Adéquate","Place à amélioration"]
[null,"1. Les énergies les plus consommées sont l’électricité et le gaz naturel.","x"]
[null,"2. Les factures d’énergie arrivent généralement aux ressources matérielles et sont ensuite acheminées aux ressources financières. ","x"]
[null,"3. La saisie et la compilation des données sont effectuées dans un fichier maison.","x"]
[null,"4. La validation des données énergétique est effectuée sur une base mensuelle.",null,"x"]
[null,"5. Lorsqu’une nouvelle personne est en charge de la collecte des données énergétiques au sein d’un MO, sa formation consiste généralement en une transmission sommaire des informations. ","x"]
[null,"6. Parmi les MO ayant des stationnements intérieurs, ce ne sont que les stationnements intérieurs chauffés et éclairés qui sont inclus dans la valeur de superficie.",null,"x"]
[null,"7. Pour l’analyse des consommations, seule une analyse sommaire des consommations est effectuée. "]
[null,"8. Les températures ne sont pas normalisées en fonction des degrés jours de chauffe.","x"]
[null,"9. Généralement, aucune estimation de données n’est effectuée. ","x"]
[null,"10. Les MO incluent généralement les consommations de tous les mois pour tous les bâtiments dans leur rapport annuel. ","x"]
[null,"11. Les documents contenant les données énergétiques, transmis à Transition énergétique Québec, doivent d’abord être révisés par une personne en autorité.","x"]
[null,"12. Les données énergétiques font partie d’une publication publiée sous la gouverne du MO. ","x"]
[null,"13. Le fichier de saisie de Transition énergétique Québec est utilisé par une grande partie des MO.","x"]
[]
[null,"Au printemps 2015, les MO ont été contactés afin de participer à une enquête au sujet de leur collecte de données énergétiques effectuée à l'automne de chaque année. Cette enquête contenait des questionnaires qui portaient sur les bâtiments et les véhicules. Le tableau précédent décrit sommairement le processus de cueillette de données énergétiques typique; il s'agit d'une synthèse illustrant ce que la majorité des répondants ont choisi comme réponse à chacune des questions. Notez qu'il s'agit du regroupement des réponses les plus courantes et non pas du processus d'un MO en particulier. Chaque affirmation affichée est évaluée afin de savoir si elle représente une étape adéquate dans le processus ou s'il pourrait y avoir place à l'amélioration."]

{"sheet":"1. IDENTITÉ","index":1,"n_rows":97,"n_cols":35,"rows_kept":97,"cut":false,"hidden":false,"merged":[[42,16,42,17]]}
[]
[]
[]
[null,"Système de suivi de la consommation énergétique dans les bâtiments"]
[null,"Dernière mise à jour : 2020-09-02"]
[null,"Version 23__03-05-2017"]
["Identité et coordonnées","Veuillez inscrire l'information dans les cellules ombragées en bleu pâle."]
[]
[]
["Ministère ou organisme :","NOM DE L'ENTITÉ","    ← Veuillez utiliser la liste déroulante pour choisir le nom de votre organisme."]
["Code du ministère ou de l'organisme :",{"$f":"IFERROR(VLOOKUP(B10,ListeMO!B3:C1000,2,FALSE),\"\")","v":""},null,null,null,null,null,null,null,null,null,null,null,null,null,null,null,null,null,null,null,null,null,null,null,null,null,null,null,null,null,null,null,null,{"$f":"COUNTIF(AM3:AM555,\"OUI\")","v":0}]
["Initiale ou acronyme :"]
["Catégorie :"]
["Nom de la personne responsable :"]
["Titre :"]
["Adresse :"]
["Ville :"]
["Téléphone :"]
["Courriel :"]
["Date :"]
["Année financière :","avril-mars","    ← Veuillez utiliser la liste déroulante pour choisir la période de l'année financière"]
["Année de référence :"]
["Facteur de consommation variable :",{"$f":"0.35","v":0.35}]
["Intensité énergétique minimale :",{"$f":"IF(B13=0,0,VLOOKUP(B13,A32:B37,2,FALSE))","v":0}]
["Intensité énergétique maximale :",{"$f":"IF(B13=0,0,VLOOKUP(B13,A32:C37,3,FALSE))","v":0}]
[]
["Autre type d'énergie?",2]
[]
["Objectif du document :"]
["     Recueillir l'information sur la consommation énergétique liée aux bâtiments de l'organisation et suivre son évolution."]
[null,"Marge d'erreur min.","Marge d'erreur max."]
[null,0.14000000000000001,1.42,null,"1er janvier au 31 décembre"]
["Etablissements d'enseignement supérieur - Cégep",0.18,1.84,null,"1er avril au 31 mars"]
["Etablissements d'enseignement supérieur - Université",0.31,3.1,null,"1er mai au 30 avril"]
["Édifices à bureaux",0.22,2.21,null,"1er juin au 31 mai"]
["Réseau de la santé et des services sociaux",0.5,4.0599999999999996,null,"1er juillet au 30 juin"]
["Autre",0.3,2.97]
[]
[]
["MESURES D'EFFICACITÉ ÉNERGÉTIQUE"]
["        Si vous avez implanté des mesures d'efficacité énergétique ou de réduction de GES, veuillez l'indiquer dans le tableau ci-dessous."]
[]
["Année","Type(s) de système(s) touché(s)",null,"Enveloppe de bâtiment","Autres actions","Commentaires",null,null,null,null,null,null,null,null,null,null,"Identité",null,"Année",1,2,3,4,5,6,7,8,9]
[null,null,null,null,null,null,null,false,false,false,false,false,false,false,false,null,{"$f":"$B$11","v":""},{"$f":"$B$10","v":"NOM DE L'ENTITÉ"},{"$f":"A44","v":0},{"$f":"IF(H44=FALSE,\"\",H44)","v":""},{"$f":"IF(I44=FALSE,\"\",I44)","v":""},"","","","","","",{"$f":"F44","v":0}]
[null,null,null,null,null,null,null,false,false,false,false,false,false,false,false,null,{"$f":"$B$11","v":""},{"$f":"$B$10","v":"NOM DE L'ENTITÉ"},{"$f":"A45","v":0},{"$f":"IF(H45=FALSE,\"\",H45)","v":""},{"$f":"IF(I45=FALSE,\"\",I45)","v":""},{"$f":"IF(J45=FALSE,\"\",J45)","v":""},{"$f":"IF(K45=FALSE,\"\",K45)","v":""},{"$f":"IF(L45=FALSE,\"\",L45)","v":""},{"$f":"IF(M45=FALSE,\"\",M45)","v":""},{"$f":"IF(N45=FALSE,\"\",N45)","v":""},"",{"$f":"F45","v":0}]
[null,null,null,null,null,null,null,false,false,false,false,false,false,false,false,null,"","NOM DE L'ENTITÉ",0,"","","","","","","","",0]
[null,null,null,null,null,null,null,false,false,false,false,false,false,false,false,null,"","NOM DE L'ENTITÉ",0,"","","","","","","","",0]
[null,null,null,null,null,null,null,false,false,false,false,false,false,false,false,null,"","NOM DE L'ENTITÉ",0,"","","","","","","","",0]
[null,null,null,null,null,null,null,false,false,false,false,false,false,false,false,null,"","NOM DE L'ENTITÉ",0,"","","","","","","","",0]
[null,null,null,null,null,null,null,false,false,false,false,false,false,false,false,null,"","NOM DE L'ENTITÉ",0,"","","","","","","","",0]
[null,null,null,null,null,null,null,false,false,false,false,false,false,false,false,null,"","NOM DE L'ENTITÉ",0,"","","","","","","","",0]
[null,null,null,null,null,null,null,false,false,false,false,false,false,false,false,null,"","NOM DE L'ENTITÉ",0,"","","","","","","","",0]
[null,null,null,null,null,null,null,false,false,false,false,false,false,false,false,null,"","NOM DE L'ENTITÉ",0,"","","","","","","","",0]
[]
[]
["2009-2010"]
["2010-2011"]
["2011-2012"]
["2012-2013"]
["2013-2014"]
["2014-2015"]
["2015-2016"]
["2016-2017"]
["2018-2019"]
["2019-2020"]
["2020-2021"]
["2021-2022"]
["2022-2023"]
["2023-2024"]
["2024-2025"]
["2025-2026"]
["2026-2027"]
["2027-2028"]
["2028-2029"]
["2029-2030"]
[2009]
[2010]
[2011]
[2012]
[2013]
[2014]
[2015]
[2016]
[2017]
[2018]
[2019]
[2020]
[2021]
[2022]
[2023]
[2024]
[2025]
[2026]
[2027]
[2028]
[2029]
[2030]

{"sheet":"2009-2010","index":2,"n_rows":56,"n_cols":42,"rows_kept":56,"cut":false,"hidden":false,"merged":[[24,0,24,7],[6,26,6,27],[6,18,6,19],[6,20,6,21],[6,22,6,23],[6,8,6,9],[6,0,7,0],[6,2,6,3],[6,4,6,5],[6,6,6,7],[6,10,6,11],[6,28,6,29],[6,12,6,13],[6,14,6,15],[6,16,6,17],[6,24,6,25]]}
[null,null,"Système de suivi de la consommation énergétique dans les bâtiments"]
[null,null,null,"Saisir les données énergétiques et les données sur les dépenses annuelles, avant taxes, dans les cellules ombragées en bleu pâle."]
[]
[null,null,null,"Dans le cas où un projet ayant un effet sur la consommation énergétique a eu lieu au cours de l'année (rénovation, agrandissement, etc.), "]
[null,null,null,"veuillez remplir la section « AJUSTEMENTS NON PÉRIODIQUES », ci-dessous."]
[]
["<-- Résumé","Superficie","Consommation électrique",null,"Gaz naturel",null,"Mazout n°2 ",null,"Mazout n°6",null,"Diesel (génératrice)",null,"Propane",null,"Résidus de bois\n (20 % d'humidité)",null,"Résidus de bois\n(45 % d'humidité)",null,"Vapeur",null,"Eau refroidie",null,"Eau chaude",null,"TOTAL",null,"Intensité énergétique",null,"GES",null,"DJC"]
[null,"[m²]","[kWh]","[$]","[m³]","[$]","[l]","[$]","[l]","[$]","[l]","[$]","[l]","[$]","[1000 kg MG]","[$]","[1000 kg MG]","[$]","[lbs]","[$]","[MBTU]","[$]","[MBTU]","[$]","[GJ]","[$]","[GJ/m²]","[$/m²]","[t CO2 éq.]","[kg CO2 éq./m²]","[° C]"]
[{"$f":"VALUE(CONCATENATE(LEFT(Annee_financiere,FIND(\"-\",Annee_financiere)-1),\"-\",A22))","v":"2009-04-01"},null,null,null,null,null,null,null,null,null,null,null,null,null,null,null,null,null,null,null,null,null,null,null,{"$f":"C9*kWh_Élect_to_GJ+E9*m3_GazNat_to_GJ+G9*L_Mazout2_to_GJ+I9*L_Mazout6_to_GJ+K9*L_Mazout2_to_GJ+M9*L_Propane_to_GJ+O9*kg_Bois8_to_GJ+Q9*kg_Bois35_to_GJ+S9*lbs_vapeur_to_GJ+U9*MBTU_eaurefroidie_to_GJ+W9*MBTU_eauchaude_to_GJ","v":0},{"$f":"D9+F9+H9+J9+N9+P9+R9+T9+V9+X9+L9","v":0},{"$f":"IF(ISERROR(Y9/B9),\"\",Y9/B9)","v":""},{"$f":"IF(ISERROR(Z9/B9),\"\",Z9/B9)","v":""},{"$f":"(C9*kWh_Élect_to_kgGES+E9*IF(U_GNat=\"[m³]\",m3_GazNat_to_kgGES,Conversion!$H$29)+G9*IF(U_Ma2=\"[l]\",L_Mazout2_to_kgGES,Conversion!$H$31)+I9*IF(U_Ma6=\"[l]\",L_Mazout6_to_kgGES,Conversion!$H$33)+K9*L_Mazout2_to_kgGES+M9*IF(U_Prop=\"[l]\",L_Propane_to_kgGES,Conversion!$H$37)+O9*kg_Bois8_to_kgGES+Q9*kg_Bois35_to_kgGES+S9*lbs_vapeur_to_kgGES+U9*MBTU_eaurefroidie_to_kgGES+W9*MBTU_eauchaude_to_kgGES)/1000","v":0},{"$f":"(IF(ISERROR(AC9/B9),0,(AC9/B9)))*1000","v":0},{"$f":"INDEX(plage_DJ,MATCH(A9,plage_date),3)","v":313.8},{"$f":"SUM(AE9)","v":313.8},12]
[{"$f":"DATE(YEAR(A9),MONTH(A9)+1,DAY(A9))","v":"2009-05-01"},null,null,null,null,null,null,null,null,null,null,null,null,null,null,null,null,null,null,null,null,null,null,null,0,{"$f":"D10+F10+H10+J10+N10+P10+R10+T10+V10+X10+L10","v":0},{"$f":"IF(ISERROR(Y10/B10),\"\",Y10/B10)","v":""},{"$f":"IF(ISERROR(Z10/B10),\"\",Z10/B10)","v":""},{"$f":"(C10*kWh_Élect_to_kgGES+E10*IF(U_GNat=\"[m³]\",m3_GazNat_to_kgGES,Conversion!$H$29)+G10*IF(U_Ma2=\"[l]\",L_Mazout2_to_kgGES,Conversion!$H$31)+I10*IF(U_Ma6=\"[l]\",L_Mazout6_to_kgGES,Conversion!$H$33)+K10*L_Mazout2_to_kgGES+M10*IF(U_Prop=\"[l]\",L_Propane_to_kgGES,Conversion!$H$37)+O10*kg_Bois8_to_kgGES+Q10*kg_Bois35_to_kgGES+S10*lbs_vapeur_to_kgGES+U10*MBTU_eaurefroidie_to_kgGES+W10*MBTU_eauchaude_to_kgGES)/1000","v":0},{"$f":"(IF(ISERROR(AC10/B10),0,(AC10/B10)))*1000","v":0},165.8,{"$f":"SUM(AE9:AE10)","v":479.6},11]
[{"$f":"DATE(YEAR(A10),MONTH(A10)+1,DAY(A10))","v":"2009-06-01"},null,null,null,null,null,null,null,null,null,null,null,null,null,null,null,null,null,null,null,null,null,null,null,0,0,"","",{"$f":"(C11*kWh_Élect_to_kgGES+E11*IF(U_GNat=\"[m³]\",m3_GazNat_to_kgGES,Conversion!$H$29)+G11*IF(U_Ma2=\"[l]\",L_Mazout2_to_kgGES,Conversion!$H$31)+I11*IF(U_Ma6=\"[l]\",L_Mazout6_to_kgGES,Conversion!$H$33)+K11*L_Mazout2_to_kgGES+M11*IF(U_Prop=\"[l]\",L_Propane_to_kgGES,Conversion!$H$37)+O11*kg_Bois8_to_kgGES+Q11*kg_Bois35_to_kgGES+S11*lbs_vapeur_to_kgGES+U11*MBTU_eaurefroidie_to_kgGES+W11*MBTU_eauchaude_to_kgGES)/1000","v":0},0,45.6,{"$f":"SUM(AE9:AE11)","v":525.20000000000005},10]
[{"$f":"DATE(YEAR(A11),MONTH(A11)+1,DAY(A11))","v":"2009-07-01"},null,null,null,null,null,null,null,null,null,null,null,null,null,null,null,null,null,null,null,null,null,null,null,0,0,"","",{"$f":"(C12*kWh_Élect_to_kgGES+E12*IF(U_GNat=\"[m³]\",m3_GazNat_to_kgGES,Conversion!$H$29)+G12*IF(U_Ma2=\"[l]\",L_Mazout2_to_kgGES,Conversion!$H$31)+I12*IF(U_Ma6=\"[l]\",L_Mazout6_to_kgGES,Conversion!$H$33)+K12*L_Mazout2_to_kgGES+M12*IF(U_Prop=\"[l]\",L_Propane_to_kgGES,Conversion!$H$37)+O12*kg_Bois8_to_kgGES+Q12*kg_Bois35_to_kgGES+S12*lbs_vapeur_to_kgGES+U12*MBTU_eaurefroidie_to_kgGES+W12*MBTU_eauchaude_to_kgGES)/1000","v":0},0,7.8,{"$f":"SUM(AE9:AE12)","v":533},9]
["2009-08-01",null,null,null,null,null,null,null,null,null,null,null,null,null,null,null,null,null,null,null,null,null,null,null,0,0,"","",{"$f":"(C13*kWh_Élect_to_kgGES+E13*IF(U_GNat=\"[m³]\",m3_GazNat_to_kgGES,Conversion!$H$29)+G13*IF(U_Ma2=\"[l]\",L_Mazout2_to_kgGES,Conversion!$H$31)+I13*IF(U_Ma6=\"[l]\",L_Mazout6_to_kgGES,Conversion!$H$33)+K13*L_Mazout2_to_kgGES+M13*IF(U_Prop=\"[l]\",L_Propane_to_kgGES,Conversion!$H$37)+O13*kg_Bois8_to_kgGES+Q13*kg_Bois35_to_kgGES+S13*lbs_vapeur_to_kgGES+U13*MBTU_eaurefroidie_to_kgGES+W13*MBTU_eauchaude_to_kgGES)/1000","v":0},0,20.100000000000001,{"$f":"SUM(AE9:AE13)","v":553.1},8]
["2009-09-01",null,null,null,null,null,null,null,null,null,null,null,null,null,null,null,null,null,null,null,null,null,null,null,0,0,"","",{"$f":"(C14*kWh_Élect_to_kgGES+E14*IF(U_GNat=\"[m³]\",m3_GazNat_to_kgGES,Conversion!$H$29)+G14*IF(U_Ma2=\"[l]\",L_Mazout2_to_kgGES,Conversion!$H$31)+I14*IF(U_Ma6=\"[l]\",L_Mazout6_to_kgGES,Conversion!$H$33)+K14*L_Mazout2_to_kgGES+M14*IF(U_Prop=\"[l]\",L_Propane_to_kgGES,Conversion!$H$37)+O14*kg_Bois8_to_kgGES+Q14*kg_Bois35_to_kgGES+S14*lbs_vapeur_to_kgGES+U14*MBTU_eaurefroidie_to_kgGES+W14*MBTU_eauchaude_to_kgGES)/1000","v":0},0,90.6,{"$f":"SUM(AE9:AE14)","v":643.70000000000005},7]
["2009-10-01",null,null,null,null,null,null,null,null,null,null,null,null,null,null,null,null,null,null,null,null,null,null,null,0,0,"","",{"$f":"(C15*kWh_Élect_to_kgGES+E15*IF(U_GNat=\"[m³]\",m3_GazNat_to_kgGES,Conversion!$H$29)+G15*IF(U_Ma2=\"[l]\",L_Mazout2_to_kgGES,Conversion!$H$31)+I15*IF(U_Ma6=\"[l]\",L_Mazout6_to_kgGES,Conversion!$H$33)+K15*L_Mazout2_to_kgGES+M15*IF(U_Prop=\"[l]\",L_Propane_to_kgGES,Conversion!$H$37)+O15*kg_Bois8_to_kgGES+Q15*kg_Bois35_to_kgGES+S15*lbs_vapeur_to_kgGES+U15*MBTU_eaurefroidie_to_kgGES+W15*MBTU_eauchaude_to_kgGES)/1000","v":0},0,342.7,{"$f":"SUM(AE9:AE15)","v":986.40000000000009},6]
["2009-11-01",null,null,null,null,null,null,null,null,null,null,null,null,null,null,null,null,null,null,null,null,null,null,null,0,0,"","",{"$f":"(C16*kWh_Élect_to_kgGES+E16*IF(U_GNat=\"[m³]\",m3_GazNat_to_kgGES,Conversion!$H$29)+G16*IF(U_Ma2=\"[l]\",L_Mazout2_to_kgGES,Conversion!$H$31)+I16*IF(U_Ma6=\"[l]\",L_Mazout6_to_kgGES,Conversion!$H$33)+K16*L_Mazout2_to_kgGES+M16*IF(U_Prop=\"[l]\",L_Propane_to_kgGES,Conversion!$H$37)+O16*kg_Bois8_to_kgGES+Q16*kg_Bois35_to_kgGES+S16*lbs_vapeur_to_kgGES+U16*MBTU_eaurefroidie_to_kgGES+W16*MBTU_eauchaude_to_kgGES)/1000","v":0},0,407.3,{"$f":"SUM(AE9:AE16)","v":1393.7},5]
["2009-12-01",null,null,null,null,null,null,null,null,null,null,null,null,null,null,null,null,null,null,null,null,null,null,null,0,0,"","",{"$f":"(C17*kWh_Élect_to_kgGES+E17*IF(U_GNat=\"[m³]\",m3_GazNat_to_kgGES,Conversion!$H$29)+G17*IF(U_Ma2=\"[l]\",L_Mazout2_to_kgGES,Conversion!$H$31)+I17*IF(U_Ma6=\"[l]\",L_Mazout6_to_kgGES,Conversion!$H$33)+K17*L_Mazout2_to_kgGES+M17*IF(U_Prop=\"[l]\",L_Propane_to_kgGES,Conversion!$H$37)+O17*kg_Bois8_to_kgGES+Q17*kg_Bois35_to_kgGES+S17*lbs_vapeur_to_kgGES+U17*MBTU_eaurefroidie_to_kgGES+W17*MBTU_eauchaude_to_kgGES)/1000","v":0},0,724.6,{"$f":"SUM(AE9:AE17)","v":2118.3000000000002},4]
["2010-01-01",null,null,null,null,null,null,null,null,null,null,null,null,null,null,null,null,null,null,null,null,null,null,null,0,0,"","",{"$f":"(C18*kWh_Élect_to_kgGES+E18*IF(U_GNat=\"[m³]\",m3_GazNat_to_kgGES,Conversion!$H$29)+G18*IF(U_Ma2=\"[l]\",L_Mazout2_to_kgGES,Conversion!$H$31)+I18*IF(U_Ma6=\"[l]\",L_Mazout6_to_kgGES,Conversion!$H$33)+K18*L_Mazout2_to_kgGES+M18*IF(U_Prop=\"[l]\",L_Propane_to_kgGES,Conversion!$H$37)+O18*kg_Bois8_to_kgGES+Q18*kg_Bois35_to_kgGES+S18*lbs_vapeur_to_kgGES+U18*MBTU_eaurefroidie_to_kgGES+W18*MBTU_eauchaude_to_kgGES)/1000","v":0},0,756.3,{"$f":"SUM(AE9:AE18)","v":2874.6000000000004},3]
["2010-02-01",null,null,null,null,null,null,null,null,null,null,null,null,null,null,null,null,null,null,null,null,null,null,null,0,0,"","",{"$f":"(C19*kWh_Élect_to_kgGES+E19*IF(U_GNat=\"[m³]\",m3_GazNat_to_kgGES,Conversion!$H$29)+G19*IF(U_Ma2=\"[l]\",L_Mazout2_to_kgGES,Conversion!$H$31)+I19*IF(U_Ma6=\"[l]\",L_Mazout6_to_kgGES,Conversion!$H$33)+K19*L_Mazout2_to_kgGES+M19*IF(U_Prop=\"[l]\",L_Propane_to_kgGES,Conversion!$H$37)+O19*kg_Bois8_to_kgGES+Q19*kg_Bois35_to_kgGES+S19*lbs_vapeur_to_kgGES+U19*MBTU_eaurefroidie_to_kgGES+W19*MBTU_eauchaude_to_kgGES)/1000","v":0},0,636.29999999999995,{"$f":"SUM(AE9:AE19)","v":3510.9000000000005},2]
["2010-03-01",null,null,null,null,null,null,null,null,null,null,null,null,null,null,null,null,null,null,null,null,null,null,null,0,0,"","",{"$f":"(C20*kWh_Élect_to_kgGES+E20*IF(U_GNat=\"[m³]\",m3_GazNat_to_kgGES,Conversion!$H$29)+G20*IF(U_Ma2=\"[l]\",L_Mazout2_to_kgGES,Conversion!$H$31)+I20*IF(U_Ma6=\"[l]\",L_Mazout6_to_kgGES,Conversion!$H$33)+K20*L_Mazout2_to_kgGES+M20*IF(U_Prop=\"[l]\",L_Propane_to_kgGES,Conversion!$H$37)+O20*kg_Bois8_to_kgGES+Q20*kg_Bois35_to_kgGES+S20*lbs_vapeur_to_kgGES+U20*MBTU_eaurefroidie_to_kgGES+W20*MBTU_eauchaude_to_kgGES)/1000","v":0},0,456.9,{"$f":"SUM(AE9:AE20)","v":3967.8000000000006},1]
["TOTAL/moyenne",{"$f":"IFERROR(AVERAGE(B9:B20),0)","v":0},{"$f":"SUM(C9:C20)","v":0},0,{"$f":"SUM(E9:E20)","v":0},0,0,0,0,0,0,0,0,0,0,0,0,0,0,0,0,0,0,0,0,{"$f":"D21+F21+H21+J21+L21+N21+P21+R21+T21+V21+X21","v":0},{"$f":"IF(ISERROR(Y21/B21),\"\",Y21/B21)","v":""},{"$f":"IF(ISERROR(Z21/B21),\"\",Z21/B21)","v":""},{"$f":"(C21*kWh_Élect_to_kgGES+E21*IF(U_GNat=\"[m³]\",m3_GazNat_to_kgGES,Conversion!$H$29)+G21*IF(U_Ma2=\"[l]\",L_Mazout2_to_kgGES,Conversion!$H$31)+I21*IF(U_Ma6=\"[l]\",L_Mazout6_to_kgGES,Conversion!$H$33)+K21*L_Mazout2_to_kgGES+M21*IF(U_Prop=\"[l]\",L_Propane_to_kgGES,Conversion!$H$37)+O21*kg_Bois8_to_kgGES+Q21*kg_Bois35_to_kgGES+S21*lbs_vapeur_to_kgGES+U21*MBTU_eaurefroidie_to_kgGES+W21*MBTU_eauchaude_to_kgGES)/1000","v":0},{"$f":"(IF(ISERROR(AC21/B21),0,(AC21/B21)))*1000","v":0},{"$f":"SUM(AE9:AE20)","v":3967.8000000000006}]
[2009,"Sup_09-10","Elec_kWh_09-10","Elec_CAD_09-10","GN_m³_09-10","GN_CAD_09-10","Ma2_l_09-10","Ma2_CAD_09-10","Ma6_l_09-10","Ma6_CAD_09-10",null,null,"Prop_l_09-10","Prop_CAD_09-10","Bois20_1000kg_09-10","Bois20_CAD_09-10","Bois45_1000kg_09-10","Bois45_CAD_09-10",null,null,null,null,null,null,"GJ_Tot_09-10","CAD_Tot_09-10","GJm²_09-10","CAD/m²_09-10","GES_ton_09-10","GES_ton/m²_09-10","DJC_tot_09-10"]
["Nombre de bâtiments en propriété ou en location, pour lesquels des factures d'énergie sont payées par l'organisation :"]
[]
["ATTENTION, la saisie des consommations d'énergie comporte une erreur si la cellule AA21 est ombragée d'une couleur !",null,null,null,null,null,null,null,null,null,null,null,null,null,null,null,null,null,null,null,null,null,null,null,null,null,{"$f":"Lim_bas","v":0},{"$f":"Lim_haut","v":0}]
[]
[null,"Résumé des ajustements non périodique","Impact pour l'année en cours [GJ]","Impact cumulatif pour les années subséquentes [GJ]",null,null,null,null,null,null,null,null,null,null,null,null,null,null,null,null,null,null,null,null,null,null,null,null,null,null,null,null,2,5,7,12,17]
[null,"2010-2011",{"$f":"GJ_Ajust_NP_Cour_10_11","v":0},{"$f":"GJ_Ajust_NP_annuel_10_11","v":0},null,null,null,null,null,null,null,null,null,null,null,null,null,null,null,null,null,null,null,null,null,null,null,null,"Source d'énergie - Unité de mesure",null,null,null,"unité","Énergie brute2 par unité (MJ)","Gigajoules brutes [GJ]/unité","GES [kg CO2]/unité","GES [kg CO2]/GJ"]
[null,"2011-2012",{"$f":"GJ_Ajust_NP_Cour_11_12","v":0},{"$f":"GJ_Ajust_NP_annuel_11_12","v":0},null,null,null,null,null,null,null,null,null,null,null,null,null,null,null,null,null,null,null,null,null,null,null,null,"Électricité",null,null,null,"kWh",3.6,3.5999999999999999E-3,2.0400000000000001E-3,0.56666666666666665,null,"facteurs de conversion"]
[null,"2012-2013",{"$f":"GJ_Ajust_NP_Cour_12_13","v":0},{"$f":"GJ_Ajust_NP_annuel_12_13","v":0},null,null,null,null,null,null,null,null,null,null,null,null,null,null,null,null,null,null,null,null,null,null,null,null,"Gaz naturel","Gaz naturel - m3",null,null,"m³",37.89,3.789E-2,1.8893169999999999,49.863209290050143,null,"m³","à","millier de pi³",3.5314669999999999E-2]
[null,"2013-2014",{"$f":"GJ_Ajust_NP_Cour_13_14","v":0},{"$f":"GJ_Ajust_NP_annuel_13_14","v":0},null,null,null,null,null,null,null,null,null,null,null,null,null,null,null,null,null,null,null,null,null,null,null,null,"Gaz naturel","Gaz naturel - Mille pi3",null,null,"millier de pi³",1072.9252177636092,1.0729252177636093,53.499494685919473,1411.9687169680517,null,"litre","à","gal imp",0.2199692]
[null,"2014-2015",{"$f":"GJ_Ajust_NP_Cour_14_15","v":0},{"$f":"GJ_Ajust_NP_annuel_14_15","v":{"$error":"#REF!"}},null,null,null,null,null,null,null,null,null,null,null,null,null,null,null,null,null,null,null,null,null,null,null,null,"Mazout 2 léger","Mazout no 2 - Litre",null,null,"L",38.5,3.85E-2,2.7347360000000003,71.032103896103905,null,"1000 kg","à","1000 lbs",2.2046199999999998]
[null,"2015-2016",{"$f":"GJ_Ajust_NP_Cour_15_16","v":0},{"$f":"GJ_Ajust_NP_annuel_15_16","v":{"$error":"#REF!"}},null,null,null,null,null,null,null,null,null,null,null,null,null,null,null,null,null,null,null,null,null,null,null,null,"Mazout 2 léger","Mazout no 2 - Gallon (imp.)",null,null,"gal imp",175.02450343048025,3.85E-2,2.7347360000000003,71.032103896103905]
[null,"2016-2017",{"$f":"GJ_Ajust_NP_Cour_16_17","v":0},{"$f":"GJ_Ajust_NP_annuel_16_17","v":0},null,null,null,null,null,null,null,null,null,null,null,null,null,null,null,null,null,null,null,null,null,null,null,null,"Mazout 6 lourd","Mazout no 6 - Litre",null,null,"L",42.5,4.2500000000000003E-2,3.14636,74.031999999999996]
[null,"2017-2018",{"$f":"GJ_Ajust_NP_Cour_17_18","v":0},{"$f":"GJ_Ajust_NP_annuel_17_18","v":0},null,null,null,null,null,null,null,null,null,null,null,null,null,null,null,null,null,null,null,null,null,null,null,null,"Mazout 6 lourd","Mazout no 6 - Gallon (imp.)",null,null,"gal imp",193.20886742325743,4.2500000000000003E-2,3.14636,74.031999999999996]
[null,"2018-2019",{"$f":"GJ_Ajust_NP_Cour_18_19","v":0},{"$f":"GJ_Ajust_NP_annuel_18_19","v":0},null,null,null,null,null,null,null,null,null,null,null,null,null,null,null,null,null,null,null,null,null,null,null,null,"Propane","Gaz propane - Litre",null,null,"L",25.31,2.5309999999999999E-2,1.543984,61.002923745555115]
[null,"2019-2020",{"$f":"GJ_Ajust_NP_Cour_19_20","v":0},{"$f":"GJ_Ajust_NP_annuel_19_20","v":0},null,null,null,null,null,null,null,null,null,null,null,null,null,null,null,null,null,null,null,null,null,null,null,null,"Propane","Gaz propane - Gallon (imp.)",null,null,"gal imp",115.06156316429754,2.5309999999999999E-2,1.543984,61.002923745555115]
[null,"2020-2021",{"$f":"GJ_Ajust_NP_Cour_20_21","v":0},{"$f":"GJ_Ajust_NP_annuel_20_21","v":0},null,null,null,null,null,null,null,null,null,null,null,null,null,null,null,null,null,null,null,null,null,null,null,null,"Résidus de bois (20% d'humidité)","Résidus de bois (20% d'humidité) - 1000kg (MG)",null,null,"kg (MG)",15.1,1.5099999999999999E-2,2.7619132653061221E-2,1.829081632653061]
[null,null,null,null,null,null,null,null,null,null,null,null,null,null,null,null,null,null,null,null,null,null,null,null,null,null,null,null,"Résidus de bois (20% d'humidité)","Résidus de bois (20% d'humidité) - 1000lbs",null,null,"1000 lbs",6.8492529324781604,6.8492529324781599E-3,1.2527842736190918E-2,0.82965845935039195]
[null,null,null,null,null,null,null,null,null,null,null,null,null,null,null,null,null,null,null,null,null,null,null,null,null,null,null,null,"Résidus de bois (45% d'humidité)","Résidus de bois (45% d'humidité) - 1000kg (MG)",null,null,"kg (MG)",9.75,9.75E-3,1.7833545918367347E-2,1.8290816326530612]
[null,null,null,null,null,null,null,null,null,null,null,null,null,null,null,null,null,null,null,null,null,null,null,null,null,null,null,null,"Résidus de bois (45% d'humidité)","Résidus de bois (45% d'humidité) - 1000lbs",null,null,"1000 lbs",4.4225308669974872,4.4225308669974877E-3,8.0891699786663218E-3,0.82965845935039206]
[null,null,null,null,null,null,null,null,null,null,null,null,null,null,null,null,null,null,null,null,null,null,null,null,null,null,null,null,"Eau refroidie","Eau refroidie - MBTU",null,null,"MBTU",292.99736302373282,0.2929973630237328,0,0]
[null,null,null,null,null,null,null,null,null,null,null,null,null,null,null,null,null,null,null,null,null,null,null,null,null,null,null,null,"Eau chaude","Eau chaude - MBTU",null,null,"MBTU",292.99736302373282,0.2929973630237328,0,0]
[null,null,null,null,null,null,null,null,null,null,null,null,null,null,null,null,null,null,null,null,null,null,null,null,null,null,null,null,"Vapeur","Vapeur - Lbs",null,null,"Lbs",1.0543,1.0543E-3,6.5713476943124821E-2,62.329011612562674]
[]
[]
[null,null,null,null,null,null,null,null,null,null,null,null,null,null,null,null,null,null,null,null,null,null,null,null,null,null,null,null,"références:"]
[null,null,null,null,null,null,null,null,null,null,null,null,null,null,null,null,null,null,null,null,null,null,null,null,null,null,null,null,1,"Annexe 13 du Rapport d'inventaire national du Canada 1990-2010 partie 3"]
[null,null,null,null,null,null,null,null,null,null,null,null,null,null,null,null,null,null,null,null,null,null,null,null,null,null,null,null,2,"Règlement sur la déclaration obligatoire de certaines émission de contaminants dans l'atmosphère, Loi sur la qualité de l'environnement, Q-2, a.2.2, 109.1 et 124.1, tableau 1-3 Facteurs d’émission selon le type de combustible"]
[null,null,null,null,null,null,null,null,null,null,null,null,null,null,null,null,null,null,null,null,null,null,null,null,null,null,null,null,null,"Utilisation des données pour usages industriels, ciment, secteur manufacturier et secteurs résidentiel, commercial, isntitutionnel, agricile et de la construction (évacuation de centrale électrique, autoconsommation ou gazoduc)."]
[]
[null,null,null,null,null,null,null,null,null,null,null,null,null,null,null,null,null,null,null,null,null,null,null,null,null,null,null,null,null,41617]
[null,null,null,null,null,null,null,null,null,null,null,null,null,null,null,null,null,null,null,null,null,null,null,null,null,null,null,null,null,"Benoît Légaré, Nadia Lalancette et Michel Fournier, on convient de d'utiliser la valeur calculée à la colonne 18"]
[null,null,null,null,null,null,null,null,null,null,null,null,null,null,null,null,null,null,null,null,null,null,null,null,null,null,null,null,null,"Ces facteurs sont les mêmes que ceux utilisés dans le fichier CompilationSommaireV5"]
[null,null,null,null,null,null,null,null,null,null,null,null,null,null,null,null,null,null,null,null,null,null,null,null,null,null,null,null,3,"Facteur de conversion normalisé pour le gaz naturel au Québec, par Gaz Métro"]
[null,null,null,null,null,null,null,null,null,null,null,null,null,null,null,null,null,null,null,null,null,null,null,null,null,null,null,null,4,"MELS- ES"]

{"sheet":"2010-2011","index":3,"n_rows":57,"n_cols":33,"rows_kept":57,"cut":false,"hidden":false,"merged":[[26,0,26,1],[26,2,26,11],[6,8,6,9],[55,10,55,11],[6,0,7,0],[6,2,6,3],[6,4,6,5],[6,6,6,7],[24,0,24,7],[6,10,6,11],[6,28,6,29],[6,12,6,13],[6,14,6,15],[6,16,6,17],[6,24,6,25],[6,26,6,27],[6,18,6,19],[6,20,6,21],[6,22,6,23]]}
[null,null,"Système de suivi de la consommation énergétique dans les bâtiments"]
[null,null,null,"Saisir les données énergétiques et les données sur les dépenses annuelles, avant taxes, dans les cellules ombragées en bleu pâle."]
[]
[null,null,null,"Dans le cas où un projet ayant un effet sur la consommation énergétique a eu lieu au cours de l'année (rénovation, agrandissement, etc.), "]
[null,null,null,"veuillez remplir la section « AJUSTEMENTS NON PÉRIODIQUES », ci-dessous."]
[]
["<-- Résumé","Superficie","Consommation électrique",null,"Gaz naturel",null,"Mazout n°2 ",null,"Mazout n°6",null,"Diesel (génératrice)",null,"Propane",null,"Résidus de bois\n (20 % d'humidité)",null,"Résidus de bois\n(45 % d'humidité)",null,"Vapeur",null,"Eau refroidie",null,"Eau chaude",null,"TOTAL",null,"Intensité énergétique",null,"GES",null,"DJC"]
[null,"[m²]","[kWh]","[$]","[m³]","[$]","[l]","[$]","[l]","[$]","[l]","[$]","[l]","[$]","[1000 kg MG]","[$]","[1000 kg MG]","[$]","[lbs]","[$]","[MBTU]","[$]","[MBTU]","[$]","[GJ]","[$]","[GJ/m²]","[$/m²]","[t CO2 éq.]","[kg CO2 éq./m²]","[° C]"]
[{"$f":"VALUE(CONCATENATE(LEFT(Annee_financiere,FIND(\"-\",Annee_financiere)-1),\"-\",A22))","v":"2010-04-01"},null,null,null,null,null,null,null,null,null,null,null,null,null,null,null,null,null,null,null,null,null,null,null,{"$f":"C9*kWh_Élect_to_GJ+E9*m3_GazNat_to_GJ+G9*L_Mazout2_to_GJ+I9*L_Mazout6_to_GJ+K9*L_Mazout2_to_GJ+M9*L_Propane_to_GJ+O9*kg_Bois8_to_GJ+Q9*kg_Bois35_to_GJ+S9*lbs_vapeur_to_GJ+U9*MBTU_eaurefroidie_to_GJ+W9*MBTU_eauchaude_to_GJ","v":0},{"$f":"D9+F9+H9+J9+N9+P9+R9+T9+V9+X9+L9","v":0},{"$f":"IF(ISERROR(Y9/B9),\"\",Y9/B9)","v":""},{"$f":"IF(ISERROR(Z9/B9),\"\",Z9/B9)","v":""},{"$f":"(C9*kWh_Élect_to_kgGES+E9*IF(U_GNat=\"[m³]\",m3_GazNat_to_kgGES,Conversion!$H$29)+G9*IF(U_Ma2=\"[l]\",L_Mazout2_to_kgGES,Conversion!$H$31)+I9*IF(U_Ma6=\"[l]\",L_Mazout6_to_kgGES,Conversion!$H$33)+K9*L_Mazout2_to_kgGES+M9*IF(U_Prop=\"[l]\",L_Propane_to_kgGES,Conversion!$H$37)+O9*kg_Bois8_to_kgGES+Q9*kg_Bois35_to_kgGES+S9*lbs_vapeur_to_kgGES+U9*MBTU_eaurefroidie_to_kgGES+W9*MBTU_eauchaude_to_kgGES)/1000","v":0},{"$f":"(IF(ISERROR(AC9/B9),0,(AC9/B9)))*1000","v":0},{"$f":"INDEX(plage_DJ,MATCH(A9,plage_date),3)","v":256.3},null,12]
[{"$f":"DATE(YEAR(A9),MONTH(A9)+1,DAY(A9))","v":"2010-05-01"},null,null,null,null,null,null,null,null,null,null,null,null,null,null,null,null,null,null,null,null,null,null,null,0,{"$f":"D10+F10+H10+J10+N10+P10+R10+T10+V10+X10+L10","v":0},{"$f":"IF(ISERROR(Y10/B10),\"\",Y10/B10)","v":""},{"$f":"IF(ISERROR(Z10/B10),\"\",Z10/B10)","v":""},{"$f":"(C10*kWh_Élect_to_kgGES+E10*IF(U_GNat=\"[m³]\",m3_GazNat_to_kgGES,Conversion!$H$29)+G10*IF(U_Ma2=\"[l]\",L_Mazout2_to_kgGES,Conversion!$H$31)+I10*IF(U_Ma6=\"[l]\",L_Mazout6_to_kgGES,Conversion!$H$33)+K10*L_Mazout2_to_kgGES+M10*IF(U_Prop=\"[l]\",L_Propane_to_kgGES,Conversion!$H$37)+O10*kg_Bois8_to_kgGES+Q10*kg_Bois35_to_kgGES+S10*lbs_vapeur_to_kgGES+U10*MBTU_eaurefroidie_to_kgGES+W10*MBTU_eauchaude_to_kgGES)/1000","v":0},{"$f":"(IF(ISERROR(AC10/B10),0,(AC10/B10)))*1000","v":0},107.9,{"$f":"SUM(AE9)","v":256.3},11]
[{"$f":"DATE(YEAR(A10),MONTH(A10)+1,DAY(A10))","v":"2010-06-01"},null,null,null,null,null,null,null,null,null,null,null,null,null,null,null,null,null,null,null,null,null,null,null,0,0,"","",{"$f":"(C11*kWh_Élect_to_kgGES+E11*IF(U_GNat=\"[m³]\",m3_GazNat_to_kgGES,Conversion!$H$29)+G11*IF(U_Ma2=\"[l]\",L_Mazout2_to_kgGES,Conversion!$H$31)+I11*IF(U_Ma6=\"[l]\",L_Mazout6_to_kgGES,Conversion!$H$33)+K11*L_Mazout2_to_kgGES+M11*IF(U_Prop=\"[l]\",L_Propane_to_kgGES,Conversion!$H$37)+O11*kg_Bois8_to_kgGES+Q11*kg_Bois35_to_kgGES+S11*lbs_vapeur_to_kgGES+U11*MBTU_eaurefroidie_to_kgGES+W11*MBTU_eauchaude_to_kgGES)/1000","v":0},0,32.4,{"$f":"SUM(AE9:AE10)","v":364.20000000000005},10]
["2010-07-01",null,null,null,null,null,null,null,null,null,null,null,null,null,null,null,null,null,null,null,null,null,null,null,0,0,"","",{"$f":"(C12*kWh_Élect_to_kgGES+E12*IF(U_GNat=\"[m³]\",m3_GazNat_to_kgGES,Conversion!$H$29)+G12*IF(U_Ma2=\"[l]\",L_Mazout2_to_kgGES,Conversion!$H$31)+I12*IF(U_Ma6=\"[l]\",L_Mazout6_to_kgGES,Conversion!$H$33)+K12*L_Mazout2_to_kgGES+M12*IF(U_Prop=\"[l]\",L_Propane_to_kgGES,Conversion!$H$37)+O12*kg_Bois8_to_kgGES+Q12*kg_Bois35_to_kgGES+S12*lbs_vapeur_to_kgGES+U12*MBTU_eaurefroidie_to_kgGES+W12*MBTU_eauchaude_to_kgGES)/1000","v":0},0,4.9000000000000004,{"$f":"SUM(AE9:AE11)","v":396.6},9]
["2010-08-01",null,null,null,null,null,null,null,null,null,null,null,null,null,null,null,null,null,null,null,null,null,null,null,0,0,"","",{"$f":"(C13*kWh_Élect_to_kgGES+E13*IF(U_GNat=\"[m³]\",m3_GazNat_to_kgGES,Conversion!$H$29)+G13*IF(U_Ma2=\"[l]\",L_Mazout2_to_kgGES,Conversion!$H$31)+I13*IF(U_Ma6=\"[l]\",L_Mazout6_to_kgGES,Conversion!$H$33)+K13*L_Mazout2_to_kgGES+M13*IF(U_Prop=\"[l]\",L_Propane_to_kgGES,Conversion!$H$37)+O13*kg_Bois8_to_kgGES+Q13*kg_Bois35_to_kgGES+S13*lbs_vapeur_to_kgGES+U13*MBTU_eaurefroidie_to_kgGES+W13*MBTU_eauchaude_to_kgGES)/1000","v":0},0,9.4,{"$f":"SUM(AE9:AE12)","v":401.5},8]
["2010-09-01",null,null,null,null,null,null,null,null,null,null,null,null,null,null,null,null,null,null,null,null,null,null,null,0,0,"","",{"$f":"(C14*kWh_Élect_to_kgGES+E14*IF(U_GNat=\"[m³]\",m3_GazNat_to_kgGES,Conversion!$H$29)+G14*IF(U_Ma2=\"[l]\",L_Mazout2_to_kgGES,Conversion!$H$31)+I14*IF(U_Ma6=\"[l]\",L_Mazout6_to_kgGES,Conversion!$H$33)+K14*L_Mazout2_to_kgGES+M14*IF(U_Prop=\"[l]\",L_Propane_to_kgGES,Conversion!$H$37)+O14*kg_Bois8_to_kgGES+Q14*kg_Bois35_to_kgGES+S14*lbs_vapeur_to_kgGES+U14*MBTU_eaurefroidie_to_kgGES+W14*MBTU_eauchaude_to_kgGES)/1000","v":0},0,84.4,{"$f":"SUM(AE9:AE13)","v":410.9},7]
["2010-10-01",null,null,null,null,null,null,null,null,null,null,null,null,null,null,null,null,null,null,null,null,null,null,null,0,0,"","",{"$f":"(C15*kWh_Élect_to_kgGES+E15*IF(U_GNat=\"[m³]\",m3_GazNat_to_kgGES,Conversion!$H$29)+G15*IF(U_Ma2=\"[l]\",L_Mazout2_to_kgGES,Conversion!$H$31)+I15*IF(U_Ma6=\"[l]\",L_Mazout6_to_kgGES,Conversion!$H$33)+K15*L_Mazout2_to_kgGES+M15*IF(U_Prop=\"[l]\",L_Propane_to_kgGES,Conversion!$H$37)+O15*kg_Bois8_to_kgGES+Q15*kg_Bois35_to_kgGES+S15*lbs_vapeur_to_kgGES+U15*MBTU_eaurefroidie_to_kgGES+W15*MBTU_eauchaude_to_kgGES)/1000","v":0},0,300.5,{"$f":"SUM(AE9:AE14)","v":495.29999999999995},6]
["2010-11-01",null,null,null,null,null,null,null,null,null,null,null,null,null,null,null,null,null,null,null,null,null,null,null,0,0,"","",{"$f":"(C16*kWh_Élect_to_kgGES+E16*IF(U_GNat=\"[m³]\",m3_GazNat_to_kgGES,Conversion!$H$29)+G16*IF(U_Ma2=\"[l]\",L_Mazout2_to_kgGES,Conversion!$H$31)+I16*IF(U_Ma6=\"[l]\",L_Mazout6_to_kgGES,Conversion!$H$33)+K16*L_Mazout2_to_kgGES+M16*IF(U_Prop=\"[l]\",L_Propane_to_kgGES,Conversion!$H$37)+O16*kg_Bois8_to_kgGES+Q16*kg_Bois35_to_kgGES+S16*lbs_vapeur_to_kgGES+U16*MBTU_eaurefroidie_to_kgGES+W16*MBTU_eauchaude_to_kgGES)/1000","v":0},0,466.6,{"$f":"SUM(AE9:AE15)","v":795.8},5]
["2010-12-01",null,null,null,null,null,null,null,null,null,null,null,null,null,null,null,null,null,null,null,null,null,null,null,0,0,"","",{"$f":"(C17*kWh_Élect_to_kgGES+E17*IF(U_GNat=\"[m³]\",m3_GazNat_to_kgGES,Conversion!$H$29)+G17*IF(U_Ma2=\"[l]\",L_Mazout2_to_kgGES,Conversion!$H$31)+I17*IF(U_Ma6=\"[l]\",L_Mazout6_to_kgGES,Conversion!$H$33)+K17*L_Mazout2_to_kgGES+M17*IF(U_Prop=\"[l]\",L_Propane_to_kgGES,Conversion!$H$37)+O17*kg_Bois8_to_kgGES+Q17*kg_Bois35_to_kgGES+S17*lbs_vapeur_to_kgGES+U17*MBTU_eaurefroidie_to_kgGES+W17*MBTU_eauchaude_to_kgGES)/1000","v":0},0,739,{"$f":"SUM(AE9:AE16)","v":1262.4000000000001},4]
["2011-01-01",null,null,null,null,null,null,null,null,null,null,null,null,null,null,null,null,null,null,null,null,null,null,null,0,0,"","",{"$f":"(C18*kWh_Élect_to_kgGES+E18*IF(U_GNat=\"[m³]\",m3_GazNat_to_kgGES,Conversion!$H$29)+G18*IF(U_Ma2=\"[l]\",L_Mazout2_to_kgGES,Conversion!$H$31)+I18*IF(U_Ma6=\"[l]\",L_Mazout6_to_kgGES,Conversion!$H$33)+K18*L_Mazout2_to_kgGES+M18*IF(U_Prop=\"[l]\",L_Propane_to_kgGES,Conversion!$H$37)+O18*kg_Bois8_to_kgGES+Q18*kg_Bois35_to_kgGES+S18*lbs_vapeur_to_kgGES+U18*MBTU_eaurefroidie_to_kgGES+W18*MBTU_eauchaude_to_kgGES)/1000","v":0},0,851.5,{"$f":"SUM(AE9:AE17)","v":2001.4},3]
["2011-02-01",null,null,null,null,null,null,null,null,null,null,null,null,null,null,null,null,null,null,null,null,null,null,null,0,0,"","",{"$f":"(C19*kWh_Élect_to_kgGES+E19*IF(U_GNat=\"[m³]\",m3_GazNat_to_kgGES,Conversion!$H$29)+G19*IF(U_Ma2=\"[l]\",L_Mazout2_to_kgGES,Conversion!$H$31)+I19*IF(U_Ma6=\"[l]\",L_Mazout6_to_kgGES,Conversion!$H$33)+K19*L_Mazout2_to_kgGES+M19*IF(U_Prop=\"[l]\",L_Propane_to_kgGES,Conversion!$H$37)+O19*kg_Bois8_to_kgGES+Q19*kg_Bois35_to_kgGES+S19*lbs_vapeur_to_kgGES+U19*MBTU_eaurefroidie_to_kgGES+W19*MBTU_eauchaude_to_kgGES)/1000","v":0},0,716.1,{"$f":"SUM(AE9:AE18)","v":2852.9},2]
["2011-03-01",null,null,null,null,null,null,null,null,null,null,null,null,null,null,null,null,null,null,null,null,null,null,null,0,0,"","",{"$f":"(C20*kWh_Élect_to_kgGES+E20*IF(U_GNat=\"[m³]\",m3_GazNat_to_kgGES,Conversion!$H$29)+G20*IF(U_Ma2=\"[l]\",L_Mazout2_to_kgGES,Conversion!$H$31)+I20*IF(U_Ma6=\"[l]\",L_Mazout6_to_kgGES,Conversion!$H$33)+K20*L_Mazout2_to_kgGES+M20*IF(U_Prop=\"[l]\",L_Propane_to_kgGES,Conversion!$H$37)+O20*kg_Bois8_to_kgGES+Q20*kg_Bois35_to_kgGES+S20*lbs_vapeur_to_kgGES+U20*MBTU_eaurefroidie_to_kgGES+W20*MBTU_eauchaude_to_kgGES)/1000","v":0},0,618.4,{"$f":"SUM(AE9:AE19)","v":3569},1]
["TOTAL/moyenne",{"$f":"IFERROR(AVERAGE(B9:B20),0)","v":0},{"$f":"SUM(C9:C20)","v":0},0,0,0,0,0,0,0,0,0,0,0,0,0,0,0,0,0,0,0,0,0,0,{"$f":"D21+F21+H21+J21+L21+N21+P21+R21+T21+V21+X21","v":0},{"$f":"IF(ISERROR(Y21/B21),\"\",Y21/B21)","v":""},{"$f":"IF(ISERROR(Z21/B21),\"\",Z21/B21)","v":""},{"$f":"(C21*kWh_Élect_to_kgGES+E21*IF(U_GNat=\"[m³]\",m3_GazNat_to_kgGES,Conversion!$H$29)+G21*IF(U_Ma2=\"[l]\",L_Mazout2_to_kgGES,Conversion!$H$31)+I21*IF(U_Ma6=\"[l]\",L_Mazout6_to_kgGES,Conversion!$H$33)+K21*L_Mazout2_to_kgGES+M21*IF(U_Prop=\"[l]\",L_Propane_to_kgGES,Conversion!$H$37)+O21*kg_Bois8_to_kgGES+Q21*kg_Bois35_to_kgGES+S21*lbs_vapeur_to_kgGES+U21*MBTU_eaurefroidie_to_kgGES+W21*MBTU_eauchaude_to_kgGES)/1000","v":0},{"$f":"(IF(ISERROR(AC21/B21),0,(AC21/B21)))*1000","v":0},{"$f":"SUM(AE9:AE20)","v":4187.3999999999996},{"$f":"AF9/AF20","v":0}]
[2010,"Sup_10-11","Elec_kWh_10-11","Elec_CAD_10-11","GN_m³_10-11","GN_CAD_10-11","Ma2_l_10-11","Ma2_CAD_10-11","Ma6_l_10-11","Ma6_CAD_10-11",null,null,"Prop_l_10-11","Prop_CAD_10-11","Bois20_1000kg_10-11","Bois20_CAD_10-11","Bois45_1000kg_10-11","Bois45_CAD_10-11",null,null,null,null,null,null,"GJ_Tot_10-11","CAD_Tot_10-11","GJm²_10-11","CAD/m²_10-11","GES_ton_10-11","GES_ton/m²_10-11","DJC_tot_10-11"]
["Nombre de bâtiments en propriété ou en location, pour lesquels des factures d'énergie sont payées par l'organisation :"]
[null,null,null,null,null,null,null,null,null,null,null,null,null,167744.38471070101]
["ATTENTION, la saisie des consommations d'énergie comporte une erreur si la cellule AA21 est ombragée d'une couleur !",null,null,null,null,null,null,null,null,null,null,null,null,null,null,null,null,null,null,null,null,null,null,"titre?",null,null,{"$f":"Lim_bas","v":0},{"$f":"Lim_haut","v":0}]
[]
["AJUSTEMENTS NON PÉRIODIQUES",null,"Un ajustement correspond à une modification majeure des équipements ou du bâtiment. Il peut avoir un effet positif ou négatif sur la consommation énergétique : \n- un effet positif correspond à une augmentation majeure de la consommation, à la suite par exemple de l'ajout d'un étage de bâtiment ou de l'ajout de climatisation d'une aile d'un bâtiment;\n- un effet négatif correspond à une diminution majeure de la consommation. Cette diminution ne résulte pas forcément d’une économie provenant d’une optimisation du bâtiment.  Elle peut, par exemple, être attribuable à la fermeture d’une partie d'un bâtiment qui devient alors inoccupé.                                                                                                                                                                                                                                                 \n\nExemple :\nL'ajout de locaux implique une augmentation nette des charges de chauffage et d'éclairage de 500 kWh, telles qu’elles sont calculées par une firme d'ingénieurs. Dans ce fichier, le projet, qui sera nommé « Agrandissement », impliquera une augmentation de l'électricité de 500 kWh. Comme il s'agit de chauffage, l'ajustement y est sensible. La date d'implantation correspond au mois où l’effet sur la consommation a été effectif.\nSi l'ajustement a eu un effet sur plus qu'une source d'énergie, merci de rajouter une ligne pour chaque source touchée."]
[]
[null,"Projet","Tendance de l'effet","Source d'énergie touchée","Effet annuel sur la référence",null,"Ajustement sensible au chauffage","Date d'implantation","Effet pour l'année complète [GJ]","Effet pour l'année en cours [GJ]",null,null,null,null,null,null,null,null,null,null,null,null,null,"Énergie de l'année de référence ajustée",{"$f":"((1-Facteur_variable)+Facteur_variable*DJC_tot_10_11/DJC_tot_09_10)*GJ_Tot_09_10+GJ_Ajust_NP_Cour_10_11","v":0},"GJTotRef_Ajust_10_11",null,"pourquoi utiliser GJ_Ajust_NP_Cour_11_12 qui représente une données partielle, plutôt que GJ_Ajust_NP_annuel_11_12"]
[null,"Nom du projet n°1",null,null,null,{"$f":"IF(D30=\"électrique\",\"kWh\",IF(D30=\"Gaz naturel\",\"m³\",IF(LEFT(D30,1)=\"R\",\"1000 kg\",\"l\")))","v":"l"},null,null,{"$f":"IF(COUNTA(G30)=1,IF(C30=\"Réduction\",-1,IF(C30=\"Augmentation\",1,0))*E30*INDEX(Conversion!$A$26:$J$42,MATCH(D30,Conversion!$J$26:$J$42,0),9),0)","v":0},{"$f":"IF(G30=\"Non\",I30*L30,IF(G30=\"Oui\",I30*K30,0))","v":0},{"$f":"(DJC_tot_10_11-INDEX($A$9:$AF$20,MATCH(H30,$A$9:$A$20,0),24))/DJC_tot_10_11","v":{"$error":"#N/A"}},{"$f":"INDEX($A$9:$AG$20,MATCH(H30,$A$9:$A$20,0),25)/12","v":{"$error":"#N/A"}},null,null,null,null,null,null,null,null,null,null,null,"Énergie de l'année de suivi",{"$f":"GJ_Tot_10_11","v":0},null,null,"-->Réponse de JD le 27 août 2012 : parce que pour l'année de suivi il faut prendre le courant et pour les années subséquentes il faut prendre l'annuel"]
[null,"Nom du projet n°2",null,null,null,{"$f":"IF(D31=\"électrique\",\"kWh\",IF(D31=\"Gaz naturel\",\"m³\",IF(LEFT(D31,1)=\"R\",\"1000 kg\",\"l\")))","v":"l"},null,null,{"$f":"IF(COUNTA(G31)=1,IF(C31=\"Réduction\",-1,IF(C31=\"Augmentation\",1,0))*E31*INDEX(Conversion!$A$26:$J$42,MATCH(D31,Conversion!$J$26:$J$42,0),9),0)","v":0},0,{"$error":"#N/A"},{"$error":"#N/A"},null,null,null,null,null,null,null,null,null,null,null,"Superficie de l'année de référence",{"$f":"Sup_09_10","v":0}]
[null,"Nom du projet n°3",null,null,null,"l",null,null,{"$f":"IF(COUNTA(G32)=1,IF(C32=\"Réduction\",-1,IF(C32=\"Augmentation\",1,0))*E32*INDEX(Conversion!$A$26:$J$42,MATCH(D32,Conversion!$J$26:$J$42,0),9),0)","v":0},0,{"$error":"#N/A"},{"$error":"#N/A"},null,null,null,null,null,null,null,null,null,null,null,"Superficie de l'année de suivi",{"$f":"Sup_10_11","v":0}]
[null,"Nom du projet n°4",null,null,null,"l",null,null,{"$f":"IF(COUNTA(G33)=1,IF(C33=\"Réduction\",-1,IF(C33=\"Augmentation\",1,0))*E33*INDEX(Conversion!$A$26:$J$42,MATCH(D33,Conversion!$J$26:$J$42,0),9),0)","v":0},0,{"$error":"#N/A"},{"$error":"#N/A"},null,null,null,null,null,null,null,null,null,null,null,null,{"$f":"GJTotRef_Ajust_10_11/Sup_09_10","v":{"$error":"#DIV/0!"}},"GJTotRef_Ajust_m²_10_11"]
[null,"Nom du projet n°5",null,null,null,"l",null,null,{"$f":"IF(COUNTA(G34)=1,IF(C34=\"Réduction\",-1,IF(C34=\"Augmentation\",1,0))*E34*INDEX(Conversion!$A$26:$J$42,MATCH(D34,Conversion!$J$26:$J$42,0),9),0)","v":0},0,{"$error":"#N/A"},{"$error":"#N/A"},null,null,null,null,null,null,null,null,null,null,null,null,{"$f":"J37","v":0},"GJ_Ajust_NP_Cour_10_11"]
[null,"Nom du projet n°6",null,null,null,"l",null,null,{"$f":"IF(COUNTA(G35)=1,IF(C35=\"Réduction\",-1,IF(C35=\"Augmentation\",1,0))*E35*INDEX(Conversion!$A$26:$J$42,MATCH(D35,Conversion!$J$26:$J$42,0),9),0)","v":0},0,{"$error":"#N/A"},{"$error":"#N/A"},null,null,null,null,null,null,null,null,null,null,null,null,{"$f":"I37","v":0},"GJ_Ajust_NP_annuel_10_11"]
[null,"Nom du projet n°7",null,null,null,"l",null,null,{"$f":"IF(COUNTA(G36)=1,IF(C36=\"Réduction\",-1,IF(C36=\"Augmentation\",1,0))*E36*INDEX(Conversion!$A$26:$J$42,MATCH(D36,Conversion!$J$26:$J$42,0),9),0)","v":0},0,{"$error":"#N/A"},{"$error":"#N/A"}]
[null,"TOTAL",null,null,null,null,null,null,{"$f":"SUM(I30:I36)","v":0},{"$f":"SUM(J30:J36)","v":0}]
[]
[]
[]
[]
[]
[]
[]
[]
[null,null,"Réduction","Électrique",null,null,"Oui"]
[null,null,"Augmentation","Gaz naturel",null,null,"Non"]
[null,null,null,"Mazout n°2"]
[null,null,null,"Mazout n°6"]
[null,null,null,"Propane"]
[null,null,null,"Résidus de bois (20 % d'humidité)"]
[null,null,null,"Résidus de bois (45 % d'humidité)"]
[null,null,null,"-"]
[]
[null,"Ne pas effacer, à blanchir et bloquer lors de la mise en route"]
[null,"Gaz naturel",null,"Mazout n°2 ",null,"Résidus de bois (20 % d'humidité)"]
[null,"[m³]","[mille pi³]","[l]","[Gallon imp]","[1000 kg MG]","[1000 lbs]"]

{"sheet":"2011-2012","index":4,"n_rows":57,"n_cols":33,"rows_kept":57,"cut":false,"hidden":false,"merged":[[6,26,6,27],[6,28,6,29],[55,10,55,11],[6,14,6,15],[6,16,6,17],[6,24,6,25],[6,18,6,19],[6,20,6,21],[6,22,6,23],[6,10,6,11],[6,12,6,13],[24,0,24,7],[26,0,26,1],[26,2,26,11],[6,0,7,0],[6,2,6,3],[6,4,6,5],[6,6,6,7],[6,8,6,9]]}
[null,null,"Système de suivi de la consommation énergétique dans les bâtiments"]
[null,null,null,"Saisir les données énergétiques et les données sur les dépenses annuelles, avant taxes, dans les cellules ombragées en bleu pâle."]
[]
[null,null,null,"Dans le cas où un projet ayant un effet sur la consommation énergétique a eu lieu au cours de l'année (rénovation, agrandissement, etc.), "]
[null,null,null,"veuillez remplir la section « AJUSTEMENTS NON PÉRIODIQUES », ci-dessous."]
[]
["<-- Résumé","Superficie","Consommation électrique",null,"Gaz naturel",null,"Mazout n°2 ",null,"Mazout n°6",null,"Diesel (génératrice)",null,"Propane",null,"Résidus de bois\n (20 % d'humidité)",null,"Résidus de bois\n(45 % d'humidité)",null,"Vapeur",null,"Eau refroidie",null,"Eau chaude",null,"TOTAL",null,"Intensité énergétique",null,"GES",null,"DJC"]
[null,"[m²]","[kWh]","[$]","[m³]","[$]","[l]","[$]","[l]","[$]","[l]","[$]","[l]","[$]","[1000 kg MG]","[$]","[1000 kg MG]","[$]","[lbs]","[$]","[MBTU]","[$]","[MBTU]","[$]","[GJ]","[$]","[GJ/m²]","[$/m²]","[t CO2 éq.]","[kg CO2 éq./m²]","[° C]"]
[{"$f":"VALUE(CONCATENATE(LEFT(Annee_financiere,FIND(\"-\",Annee_financiere)-1),\"-\",A22))","v":"2011-04-01"},null,null,null,null,null,null,null,null,null,null,null,null,null,null,null,null,null,null,null,null,null,null,null,{"$f":"C9*kWh_Élect_to_GJ+E9*m3_GazNat_to_GJ+G9*L_Mazout2_to_GJ+I9*L_Mazout6_to_GJ+K9*L_Mazout2_to_GJ+M9*L_Propane_to_GJ+O9*kg_Bois8_to_GJ+Q9*kg_Bois35_to_GJ+S9*lbs_vapeur_to_GJ+U9*MBTU_eaurefroidie_to_GJ+W9*MBTU_eauchaude_to_GJ","v":0},{"$f":"D9+F9+H9+J9+N9+P9+R9+T9+V9+X9+L9","v":0},{"$f":"IF(ISERROR(Y9/B9),\"\",Y9/B9)","v":""},{"$f":"IF(ISERROR(Z9/B9),\"\",Z9/B9)","v":""},{"$f":"(C9*kWh_Élect_to_kgGES+E9*IF(U_GNat=\"[m³]\",m3_GazNat_to_kgGES,Conversion!$H$29)+G9*IF(U_Ma2=\"[l]\",L_Mazout2_to_kgGES,Conversion!$H$31)+I9*IF(U_Ma6=\"[l]\",L_Mazout6_to_kgGES,Conversion!$H$33)+K9*L_Mazout2_to_kgGES+M9*IF(U_Prop=\"[l]\",L_Propane_to_kgGES,Conversion!$H$37)+O9*kg_Bois8_to_kgGES+Q9*kg_Bois35_to_kgGES+S9*lbs_vapeur_to_kgGES+U9*MBTU_eaurefroidie_to_kgGES+W9*MBTU_eauchaude_to_kgGES)/1000","v":0},{"$f":"(IF(ISERROR(AC9/B9),0,(AC9/B9)))*1000","v":0},{"$f":"INDEX(plage_DJ,MATCH(A9,plage_date),3)","v":341.6},null,12]
[{"$f":"DATE(YEAR(A9),MONTH(A9)+1,DAY(A9))","v":"2011-05-01"},null,null,null,null,null,null,null,null,null,null,null,null,null,null,null,null,null,null,null,null,null,null,null,0,{"$f":"D10+F10+H10+J10+N10+P10+R10+T10+V10+X10+L10","v":0},{"$f":"IF(ISERROR(Y10/B10),\"\",Y10/B10)","v":""},{"$f":"IF(ISERROR(Z10/B10),\"\",Z10/B10)","v":""},{"$f":"(C10*kWh_Élect_to_kgGES+E10*IF(U_GNat=\"[m³]\",m3_GazNat_to_kgGES,Conversion!$H$29)+G10*IF(U_Ma2=\"[l]\",L_Mazout2_to_kgGES,Conversion!$H$31)+I10*IF(U_Ma6=\"[l]\",L_Mazout6_to_kgGES,Conversion!$H$33)+K10*L_Mazout2_to_kgGES+M10*IF(U_Prop=\"[l]\",L_Propane_to_kgGES,Conversion!$H$37)+O10*kg_Bois8_to_kgGES+Q10*kg_Bois35_to_kgGES+S10*lbs_vapeur_to_kgGES+U10*MBTU_eaurefroidie_to_kgGES+W10*MBTU_eauchaude_to_kgGES)/1000","v":0},{"$f":"(IF(ISERROR(AC10/B10),0,(AC10/B10)))*1000","v":0},138,{"$f":"SUM(AE9)","v":341.6},11]
[{"$f":"DATE(YEAR(A10),MONTH(A10)+1,DAY(A10))","v":"2011-06-01"},null,null,null,null,null,null,null,null,null,null,null,null,null,null,null,null,null,null,null,null,null,null,null,0,0,"","",{"$f":"(C11*kWh_Élect_to_kgGES+E11*IF(U_GNat=\"[m³]\",m3_GazNat_to_kgGES,Conversion!$H$29)+G11*IF(U_Ma2=\"[l]\",L_Mazout2_to_kgGES,Conversion!$H$31)+I11*IF(U_Ma6=\"[l]\",L_Mazout6_to_kgGES,Conversion!$H$33)+K11*L_Mazout2_to_kgGES+M11*IF(U_Prop=\"[l]\",L_Propane_to_kgGES,Conversion!$H$37)+O11*kg_Bois8_to_kgGES+Q11*kg_Bois35_to_kgGES+S11*lbs_vapeur_to_kgGES+U11*MBTU_eaurefroidie_to_kgGES+W11*MBTU_eauchaude_to_kgGES)/1000","v":0},0,19.399999999999999,{"$f":"SUM(AE9:AE10)","v":479.6},10]
["2011-07-01",null,null,null,null,null,null,null,null,null,null,null,null,null,null,null,null,null,null,null,null,null,null,null,0,0,"","",{"$f":"(C12*kWh_Élect_to_kgGES+E12*IF(U_GNat=\"[m³]\",m3_GazNat_to_kgGES,Conversion!$H$29)+G12*IF(U_Ma2=\"[l]\",L_Mazout2_to_kgGES,Conversion!$H$31)+I12*IF(U_Ma6=\"[l]\",L_Mazout6_to_kgGES,Conversion!$H$33)+K12*L_Mazout2_to_kgGES+M12*IF(U_Prop=\"[l]\",L_Propane_to_kgGES,Conversion!$H$37)+O12*kg_Bois8_to_kgGES+Q12*kg_Bois35_to_kgGES+S12*lbs_vapeur_to_kgGES+U12*MBTU_eaurefroidie_to_kgGES+W12*MBTU_eauchaude_to_kgGES)/1000","v":0},0,0,{"$f":"SUM(AE9:AE11)","v":499},9]
["2011-08-01",null,null,null,null,null,null,null,null,null,null,null,null,null,null,null,null,null,null,null,null,null,null,null,0,0,"","",{"$f":"(C13*kWh_Élect_to_kgGES+E13*IF(U_GNat=\"[m³]\",m3_GazNat_to_kgGES,Conversion!$H$29)+G13*IF(U_Ma2=\"[l]\",L_Mazout2_to_kgGES,Conversion!$H$31)+I13*IF(U_Ma6=\"[l]\",L_Mazout6_to_kgGES,Conversion!$H$33)+K13*L_Mazout2_to_kgGES+M13*IF(U_Prop=\"[l]\",L_Propane_to_kgGES,Conversion!$H$37)+O13*kg_Bois8_to_kgGES+Q13*kg_Bois35_to_kgGES+S13*lbs_vapeur_to_kgGES+U13*MBTU_eaurefroidie_to_kgGES+W13*MBTU_eauchaude_to_kgGES)/1000","v":0},0,2.4,{"$f":"SUM(AE9:AE12)","v":499},8]
["2011-09-01",null,null,null,null,null,null,null,null,null,null,null,null,null,null,null,null,null,null,null,null,null,null,null,0,0,"","",{"$f":"(C14*kWh_Élect_to_kgGES+E14*IF(U_GNat=\"[m³]\",m3_GazNat_to_kgGES,Conversion!$H$29)+G14*IF(U_Ma2=\"[l]\",L_Mazout2_to_kgGES,Conversion!$H$31)+I14*IF(U_Ma6=\"[l]\",L_Mazout6_to_kgGES,Conversion!$H$33)+K14*L_Mazout2_to_kgGES+M14*IF(U_Prop=\"[l]\",L_Propane_to_kgGES,Conversion!$H$37)+O14*kg_Bois8_to_kgGES+Q14*kg_Bois35_to_kgGES+S14*lbs_vapeur_to_kgGES+U14*MBTU_eaurefroidie_to_kgGES+W14*MBTU_eauchaude_to_kgGES)/1000","v":0},0,46.6,{"$f":"SUM(AE9:AE13)","v":501.4},7]
["2011-10-01",null,null,null,null,null,null,null,null,null,null,null,null,null,null,null,null,null,null,null,null,null,null,null,0,0,"","",{"$f":"(C15*kWh_Élect_to_kgGES+E15*IF(U_GNat=\"[m³]\",m3_GazNat_to_kgGES,Conversion!$H$29)+G15*IF(U_Ma2=\"[l]\",L_Mazout2_to_kgGES,Conversion!$H$31)+I15*IF(U_Ma6=\"[l]\",L_Mazout6_to_kgGES,Conversion!$H$33)+K15*L_Mazout2_to_kgGES+M15*IF(U_Prop=\"[l]\",L_Propane_to_kgGES,Conversion!$H$37)+O15*kg_Bois8_to_kgGES+Q15*kg_Bois35_to_kgGES+S15*lbs_vapeur_to_kgGES+U15*MBTU_eaurefroidie_to_kgGES+W15*MBTU_eauchaude_to_kgGES)/1000","v":0},0,252,{"$f":"SUM(AE9:AE14)","v":548},6]
["2011-11-01",null,null,null,null,null,null,null,null,null,null,null,null,null,null,null,null,null,null,null,null,null,null,null,0,0,"","",{"$f":"(C16*kWh_Élect_to_kgGES+E16*IF(U_GNat=\"[m³]\",m3_GazNat_to_kgGES,Conversion!$H$29)+G16*IF(U_Ma2=\"[l]\",L_Mazout2_to_kgGES,Conversion!$H$31)+I16*IF(U_Ma6=\"[l]\",L_Mazout6_to_kgGES,Conversion!$H$33)+K16*L_Mazout2_to_kgGES+M16*IF(U_Prop=\"[l]\",L_Propane_to_kgGES,Conversion!$H$37)+O16*kg_Bois8_to_kgGES+Q16*kg_Bois35_to_kgGES+S16*lbs_vapeur_to_kgGES+U16*MBTU_eaurefroidie_to_kgGES+W16*MBTU_eauchaude_to_kgGES)/1000","v":0},0,381.6,{"$f":"SUM(AE9:AE15)","v":800},5]
["2011-12-01",null,null,null,null,null,null,null,null,null,null,null,null,null,null,null,null,null,null,null,null,null,null,null,0,0,"","",{"$f":"(C17*kWh_Élect_to_kgGES+E17*IF(U_GNat=\"[m³]\",m3_GazNat_to_kgGES,Conversion!$H$29)+G17*IF(U_Ma2=\"[l]\",L_Mazout2_to_kgGES,Conversion!$H$31)+I17*IF(U_Ma6=\"[l]\",L_Mazout6_to_kgGES,Conversion!$H$33)+K17*L_Mazout2_to_kgGES+M17*IF(U_Prop=\"[l]\",L_Propane_to_kgGES,Conversion!$H$37)+O17*kg_Bois8_to_kgGES+Q17*kg_Bois35_to_kgGES+S17*lbs_vapeur_to_kgGES+U17*MBTU_eaurefroidie_to_kgGES+W17*MBTU_eauchaude_to_kgGES)/1000","v":0},0,637.6,{"$f":"SUM(AE9:AE16)","v":1181.5999999999999},4]
["2012-01-01",null,null,null,null,null,null,null,null,null,null,null,null,null,null,null,null,null,null,null,null,null,null,null,0,0,"","",{"$f":"(C18*kWh_Élect_to_kgGES+E18*IF(U_GNat=\"[m³]\",m3_GazNat_to_kgGES,Conversion!$H$29)+G18*IF(U_Ma2=\"[l]\",L_Mazout2_to_kgGES,Conversion!$H$31)+I18*IF(U_Ma6=\"[l]\",L_Mazout6_to_kgGES,Conversion!$H$33)+K18*L_Mazout2_to_kgGES+M18*IF(U_Prop=\"[l]\",L_Propane_to_kgGES,Conversion!$H$37)+O18*kg_Bois8_to_kgGES+Q18*kg_Bois35_to_kgGES+S18*lbs_vapeur_to_kgGES+U18*MBTU_eaurefroidie_to_kgGES+W18*MBTU_eauchaude_to_kgGES)/1000","v":0},0,788.3,{"$f":"SUM(AE9:AE17)","v":1819.1999999999998},3]
["2012-02-01",null,null,null,null,null,null,null,null,null,null,null,null,null,null,null,null,null,null,null,null,null,null,null,0,0,"","",{"$f":"(C19*kWh_Élect_to_kgGES+E19*IF(U_GNat=\"[m³]\",m3_GazNat_to_kgGES,Conversion!$H$29)+G19*IF(U_Ma2=\"[l]\",L_Mazout2_to_kgGES,Conversion!$H$31)+I19*IF(U_Ma6=\"[l]\",L_Mazout6_to_kgGES,Conversion!$H$33)+K19*L_Mazout2_to_kgGES+M19*IF(U_Prop=\"[l]\",L_Propane_to_kgGES,Conversion!$H$37)+O19*kg_Bois8_to_kgGES+Q19*kg_Bois35_to_kgGES+S19*lbs_vapeur_to_kgGES+U19*MBTU_eaurefroidie_to_kgGES+W19*MBTU_eauchaude_to_kgGES)/1000","v":0},0,659.7,{"$f":"SUM(AE9:AE18)","v":2607.5},2]
["2012-03-01",null,null,null,null,null,null,null,null,null,null,null,null,null,null,null,null,null,null,null,null,null,null,null,0,0,"","",{"$f":"(C20*kWh_Élect_to_kgGES+E20*IF(U_GNat=\"[m³]\",m3_GazNat_to_kgGES,Conversion!$H$29)+G20*IF(U_Ma2=\"[l]\",L_Mazout2_to_kgGES,Conversion!$H$31)+I20*IF(U_Ma6=\"[l]\",L_Mazout6_to_kgGES,Conversion!$H$33)+K20*L_Mazout2_to_kgGES+M20*IF(U_Prop=\"[l]\",L_Propane_to_kgGES,Conversion!$H$37)+O20*kg_Bois8_to_kgGES+Q20*kg_Bois35_to_kgGES+S20*lbs_vapeur_to_kgGES+U20*MBTU_eaurefroidie_to_kgGES+W20*MBTU_eauchaude_to_kgGES)/1000","v":0},0,462.8,{"$f":"SUM(AE9:AE19)","v":3267.2},1]
["TOTAL/moyenne",{"$f":"IF(ISERROR(AVERAGE(B9:B20)),0,AVERAGE(B9:B20))","v":0},{"$f":"SUM(C9:C20)","v":0},0,0,0,0,0,0,0,0,0,0,0,0,0,0,0,0,0,0,0,0,0,0,{"$f":"D21+F21+H21+J21+L21+N21+P21+R21+T21+V21+X21","v":0},{"$f":"IF(ISERROR(Y21/B21),\"\",Y21/B21)","v":""},{"$f":"IF(ISERROR(Z21/B21),\"\",Z21/B21)","v":""},{"$f":"(C21*kWh_Élect_to_kgGES+E21*IF(U_GNat=\"[m³]\",m3_GazNat_to_kgGES,Conversion!$H$29)+G21*IF(U_Ma2=\"[l]\",L_Mazout2_to_kgGES,Conversion!$H$31)+I21*IF(U_Ma6=\"[l]\",L_Mazout6_to_kgGES,Conversion!$H$33)+K21*L_Mazout2_to_kgGES+M21*IF(U_Prop=\"[l]\",L_Propane_to_kgGES,Conversion!$H$37)+O21*kg_Bois8_to_kgGES+Q21*kg_Bois35_to_kgGES+S21*lbs_vapeur_to_kgGES+U21*MBTU_eaurefroidie_to_kgGES+W21*MBTU_eauchaude_to_kgGES)/1000","v":0},{"$f":"(IF(ISERROR(AC21/B21),0,(AC21/B21)))*1000","v":0},{"$f":"SUM(AE9:AE20)","v":3730}]
[2011,"Sup_11-12","Elec_kWh_11-12","Elec_CAD_11-12","GN_m³_11-12","GN_CAD_11-12","Ma2_l_11-12","Ma2_CAD_11-12","Ma6_l_11-12","Ma6_CAD_11-12",null,null,"Prop_l_11-12","Prop_CAD_11-12","Bois20_1000kg_11-12","Bois20_CAD_11-12","Bois45_1000kg_11-12","Bois45_CAD_11-12",null,null,null,null,null,null,"GJ_Tot_11-12","CAD_Tot_11-12","GJm²_11-12","CAD/m²_11-12","GES_ton_11-12","GES_ton/m²_11-12","DJC_tot_11-12"]
["Nombre de bâtiments en propriété ou en location, pour lesquels des factures d'énergie sont payées par l'organisation :"]
[]
["ATTENTION, la saisie des consommations d'énergie comporte une erreur si la cellule AA21 est ombragée d'une couleur !",null,null,null,null,null,null,null,null,null,null,null,null,null,null,null,null,null,null,null,null,null,null,null,null,null,{"$f":"Lim_bas","v":0},{"$f":"Lim_haut","v":0}]
[]
["AJUSTEMENTS NON PÉRIODIQUES",null,"Un ajustement correspond à une modification majeure des équipements ou du bâtiment. Il peut avoir un effet positif ou négatif sur la consommation énergétique : \n- un effet positif correspond à une augmentation majeure de la consommation, à la suite par exemple de l'ajout d'un étage de bâtiment ou de l'ajout de climatisation d'une aile d'un bâtiment;\n- un effet négatif correspond à une diminution majeure de la consommation. Cette diminution ne résulte pas forcément d’une économie provenant d’une optimisation du bâtiment.  Elle peut, par exemple, être attribuable à la fermeture d’une partie d'un bâtiment qui devient alors inoccupé.                                                                                                                                                                                                                                                 \n\nExemple :\nL'ajout de locaux implique une augmentation nette des charges de chauffage et d'éclairage de 500 kWh, telles qu’elles sont calculées par une firme d'ingénieurs. Dans ce fichier, le projet, qui sera nommé « Agrandissement », impliquera une augmentation de l'électricité de 500 kWh. Comme il s'agit de chauffage, l'ajustement y est sensible. La date d'implantation correspond au mois où l’effet sur la consommation a été effectif.\nSi l'ajustement a eu un effet sur plus qu'une source d'énergie, merci de rajouter une ligne pour chaque source touchée."]
[]
[null,"Projet","Tendance de l'impact","Source d'énergie touchée","Impact Annuel sur la référence",null,"Ajustement sensible au chauffage","Date d'implantation","Effet pour l'année complète [GJ]","Effet pour l'année en cours [GJ]",null,null,null,null,null,null,null,null,null,null,null,null,null,"Énergie de l'année de référence ajustée",{"$f":"((1-Facteur_variable)+Facteur_variable*DJC_tot_11_12/DJC_tot_09_10)*GJ_Tot_09_10+GJ_Ajust_NP_Cour_11_12","v":0},"GJTotRef_Ajust_11_12"]
[null,"Nom du projet no1",null,null,null,{"$f":"IF(D30=\"électrique\",\"kWh\",IF(D30=\"Gaz naturel\",\"m³\",IF(LEFT(D30,1)=\"R\",\"1000 kg\",\"l\")))","v":"l"},null,null,{"$f":"IF(COUNTA(G30)=1,IF(C30=\"Réduction\",-1,IF(C30=\"Augmentation\",1,0))*E30*INDEX(Conversion!$A$26:$J$42,MATCH(D30,Conversion!$J$26:$J$42,0),9),0)","v":0},{"$f":"IF(G30=\"Non\",I30*L30,IF(G30=\"Oui\",I30*K30,0))","v":0},{"$f":"(DJC_tot_11_12-INDEX($A$9:$AF$20,MATCH(H30,$A$9:$A$20,0),24))/DJC_tot_11_12","v":{"$error":"#N/A"}},{"$f":"INDEX($A$9:$AG$20,MATCH(H30,$A$9:$A$20,0),25)/12","v":{"$error":"#N/A"}},null,null,null,null,null,null,null,null,null,null,null,"Énergie de l'année de suivi",{"$f":"GJ_Tot_11_12","v":0}]
[null,"Nom du projet no2",null,null,null,{"$f":"IF(D31=\"électrique\",\"kWh\",IF(D31=\"Gaz naturel\",\"m³\",IF(LEFT(D31,1)=\"R\",\"1000 kg\",\"l\")))","v":"l"},null,null,{"$f":"IF(COUNTA(G31)=1,IF(C31=\"Réduction\",-1,IF(C31=\"Augmentation\",1,0))*E31*INDEX(Conversion!$A$26:$J$42,MATCH(D31,Conversion!$J$26:$J$42,0),9),0)","v":0},0,{"$f":"(DJC_tot_10_11-INDEX($A$9:$AF$20,MATCH(H31,$A$9:$A$20,0),24))/DJC_tot_11_12","v":{"$error":"#N/A"}},{"$error":"#N/A"},null,null,null,null,null,null,null,null,null,null,null,"Superficie de l'année de référence",{"$f":"Sup_09_10","v":0}]
[null,"Nom du projet no3",null,null,null,"l",null,null,{"$f":"IF(COUNTA(G32)=1,IF(C32=\"Réduction\",-1,IF(C32=\"Augmentation\",1,0))*E32*INDEX(Conversion!$A$26:$J$42,MATCH(D32,Conversion!$J$26:$J$42,0),9),0)","v":0},0,{"$error":"#N/A"},{"$error":"#N/A"},null,null,null,null,null,null,null,null,null,null,null,"Superficie de l'année de suivi",{"$f":"Sup_11_12","v":0}]
[null,"Nom du projet no4",null,null,null,"l",null,null,{"$f":"IF(COUNTA(G33)=1,IF(C33=\"Réduction\",-1,IF(C33=\"Augmentation\",1,0))*E33*INDEX(Conversion!$A$26:$J$42,MATCH(D33,Conversion!$J$26:$J$42,0),9),0)","v":0},0,{"$error":"#N/A"},{"$error":"#N/A"},null,null,null,null,null,null,null,null,null,null,null,null,{"$f":"GJTotRef_Ajust_11_12/Sup_09_10","v":{"$error":"#DIV/0!"}},"GJTotRef_Ajust_m²_11_12"]
[null,"Nom du projet no5",null,null,null,"l",null,null,{"$f":"IF(COUNTA(G34)=1,IF(C34=\"Réduction\",-1,IF(C34=\"Augmentation\",1,0))*E34*INDEX(Conversion!$A$26:$J$42,MATCH(D34,Conversion!$J$26:$J$42,0),9),0)","v":0},0,{"$error":"#N/A"},{"$error":"#N/A"},null,null,null,null,null,null,null,null,null,null,null,null,{"$f":"J37","v":0},"GJ_Ajust_NP_Cour_11_12"]
[null,"Nom du projet no6",null,null,null,"l",null,null,{"$f":"IF(COUNTA(G35)=1,IF(C35=\"Réduction\",-1,IF(C35=\"Augmentation\",1,0))*E35*INDEX(Conversion!$A$26:$J$42,MATCH(D35,Conversion!$J$26:$J$42,0),9),0)","v":0},0,{"$error":"#N/A"},{"$error":"#N/A"},null,null,null,null,null,null,null,null,null,null,null,null,{"$f":"I37","v":0},"GJ_Ajust_NP_annuel_11_12"]
[null,"Nom du projet no7",null,null,null,"l",null,null,{"$f":"IF(COUNTA(G36)=1,IF(C36=\"Réduction\",-1,IF(C36=\"Augmentation\",1,0))*E36*INDEX(Conversion!$A$26:$J$42,MATCH(D36,Conversion!$J$26:$J$42,0),9),0)","v":0},0,{"$error":"#N/A"},{"$error":"#N/A"}]
[null,"TOTAL",null,null,null,null,null,null,{"$f":"SUM(I30:I36)","v":0},{"$f":"SUM(J30:J36)","v":0}]
[]
[]
[]
[]
[]
[]
[]
[]
[null,null,"Réduction","Électrique",null,null,"Oui"]
[null,null,"Augmentation","Gaz naturel",null,null,"Non"]
[null,null,null,"Mazout n°2"]
[null,null,null,"Mazout n°6"]
[null,null,null,"Propane"]
[null,null,null,"Résidus de bois (20%humidité)"]
[null,null,null,"Résidus de bois (45%humidité)"]
[null,null,null,"-"]
[]
[null,"Ne pas effacer, à blanchir et bloquer lora de la mise en route"]
[null,"Gaz naturel",null,"Mazout n°2 ",null,"Résidus de bois (20% d'humidité)"]
[null,"[m³]","[mille pi³]","[l]","[Gallon imp]","[1000 kg MG]","[1000 lbs]"]

{"sheet":"2012-2013","index":5,"n_rows":53,"n_cols":33,"rows_kept":53,"cut":false,"hidden":false,"merged":[[6,12,6,13],[6,18,6,19],[6,20,6,21],[6,28,6,29],[6,14,6,15],[6,22,6,23],[6,16,6,17],[6,24,6,25],[6,26,6,27],[26,0,26,1],[26,2,26,11],[6,0,7,0],[6,2,6,3],[6,4,6,5],[6,6,6,7],[6,10,6,11],[24,0,24,7],[6,8,6,9]]}
[null,null,"Système de suivi de la consommation énergétique dans les bâtiments"]
[null,null,null,"Saisir les données énergétiques et les données sur les dépenses annuelles, avant taxes, dans les cellules ombragées en bleu pâle."]
[]
[null,null,null,"Dans le cas où un projet ayant un effet sur la consommation énergétique a eu lieu au cours de l'année (rénovation, agrandissement, etc.), "]
[null,null,null,"veuillez remplir la section « AJUSTEMENTS NON PÉRIODIQUES », ci-dessous."]
[]
["<-- Résumé","Superficie","Consommation électrique",null,"Gaz naturel",null,"Mazout n°2 ",null,"Mazout n°6",null,"Diesel (génératrice)",null,"Propane",null,"Résidus de bois\n (20 % d'humidité)",null,"Résidus de bois\n(45 % d'humidité)",null,"Vapeur",null,"Eau refroidie",null,"Eau chaude",null,"TOTAL",null,"Intensité énergétique",null,"GES",null,"DJC"]
[null,"[m²]","[kWh]","[$]","[m³]","[$]","[l]","[$]","[l]","[$]","[l]","[$]","[l]","[$]","[1000 kg MG]","[$]","[1000 kg MG]","[$]","[lbs]","[$]","[MBTU]","[$]","[MBTU]","[$]"," [GJ]","[$]","[GJ/m²]","[$/m²]","[t CO2 éq.]","[kg CO2 éq./m²]"," [° C]"]
[{"$f":"VALUE(CONCATENATE(LEFT(Annee_financiere,FIND(\"-\",Annee_financiere)-1),\"-\",A22))","v":"2012-04-01"},null,null,null,null,null,null,null,null,null,null,null,null,null,null,null,null,null,null,null,null,null,null,null,{"$f":"C9*kWh_Élect_to_GJ+E9*m3_GazNat_to_GJ+G9*L_Mazout2_to_GJ+I9*L_Mazout6_to_GJ+K9*L_Mazout2_to_GJ+M9*L_Propane_to_GJ+O9*kg_Bois8_to_GJ+Q9*kg_Bois35_to_GJ+S9*lbs_vapeur_to_GJ+U9*MBTU_eaurefroidie_to_GJ+W9*MBTU_eauchaude_to_GJ","v":0},{"$f":"D9+F9+H9+J9+N9+P9+R9+T9+V9+X9+L9","v":0},{"$f":"IF(ISERROR(Y9/B9),\"\",Y9/B9)","v":""},{"$f":"IF(ISERROR(Z9/B9),\"\",Z9/B9)","v":""},{"$f":"(C9*kWh_Élect_to_kgGES+E9*IF(U_GNat=\"[m³]\",m3_GazNat_to_kgGES,Conversion!$H$29)+G9*IF(U_Ma2=\"[l]\",L_Mazout2_to_kgGES,Conversion!$H$31)+I9*IF(U_Ma6=\"[l]\",L_Mazout6_to_kgGES,Conversion!$H$33)+K9*L_Mazout2_to_kgGES+M9*IF(U_Prop=\"[l]\",L_Propane_to_kgGES,Conversion!$H$37)+O9*kg_Bois8_to_kgGES+Q9*kg_Bois35_to_kgGES+S9*lbs_vapeur_to_kgGES+U9*MBTU_eaurefroidie_to_kgGES+W9*MBTU_eauchaude_to_kgGES)/1000","v":0},{"$f":"(IF(ISERROR(AC9/B9),0,(AC9/B9)))*1000","v":0},{"$f":"INDEX(plage_DJ,MATCH(A9,plage_date),3)","v":339.2},null,12]
[{"$f":"DATE(YEAR(A9),MONTH(A9)+1,DAY(A9))","v":"2012-05-01"},null,null,null,null,null,null,null,null,null,null,null,null,null,null,null,null,null,null,null,null,null,null,null,0,{"$f":"D10+F10+H10+J10+N10+P10+R10+T10+V10+X10+L10","v":0},{"$f":"IF(ISERROR(Y10/B10),\"\",Y10/B10)","v":""},{"$f":"IF(ISERROR(Z10/B10),\"\",Z10/B10)","v":""},{"$f":"(C10*kWh_Élect_to_kgGES+E10*IF(U_GNat=\"[m³]\",m3_GazNat_to_kgGES,Conversion!$H$29)+G10*IF(U_Ma2=\"[l]\",L_Mazout2_to_kgGES,Conversion!$H$31)+I10*IF(U_Ma6=\"[l]\",L_Mazout6_to_kgGES,Conversion!$H$33)+K10*L_Mazout2_to_kgGES+M10*IF(U_Prop=\"[l]\",L_Propane_to_kgGES,Conversion!$H$37)+O10*kg_Bois8_to_kgGES+Q10*kg_Bois35_to_kgGES+S10*lbs_vapeur_to_kgGES+U10*MBTU_eaurefroidie_to_kgGES+W10*MBTU_eauchaude_to_kgGES)/1000","v":0},{"$f":"(IF(ISERROR(AC10/B10),0,(AC10/B10)))*1000","v":0},89.9,{"$f":"SUM(AE9)","v":339.2},11]
[{"$f":"DATE(YEAR(A10),MONTH(A10)+1,DAY(A10))","v":"2012-06-01"},null,null,null,null,null,null,null,null,null,null,null,null,null,null,null,null,null,null,null,null,null,null,null,0,0,"","",{"$f":"(C11*kWh_Élect_to_kgGES+E11*IF(U_GNat=\"[m³]\",m3_GazNat_to_kgGES,Conversion!$H$29)+G11*IF(U_Ma2=\"[l]\",L_Mazout2_to_kgGES,Conversion!$H$31)+I11*IF(U_Ma6=\"[l]\",L_Mazout6_to_kgGES,Conversion!$H$33)+K11*L_Mazout2_to_kgGES+M11*IF(U_Prop=\"[l]\",L_Propane_to_kgGES,Conversion!$H$37)+O11*kg_Bois8_to_kgGES+Q11*kg_Bois35_to_kgGES+S11*lbs_vapeur_to_kgGES+U11*MBTU_eaurefroidie_to_kgGES+W11*MBTU_eauchaude_to_kgGES)/1000","v":0},0,21.5,{"$f":"SUM(AE9:AE10)","v":429.1},10]
["2012-07-01",null,null,null,null,null,null,null,null,null,null,null,null,null,null,null,null,null,null,null,null,null,null,null,0,0,"","",{"$f":"(C12*kWh_Élect_to_kgGES+E12*IF(U_GNat=\"[m³]\",m3_GazNat_to_kgGES,Conversion!$H$29)+G12*IF(U_Ma2=\"[l]\",L_Mazout2_to_kgGES,Conversion!$H$31)+I12*IF(U_Ma6=\"[l]\",L_Mazout6_to_kgGES,Conversion!$H$33)+K12*L_Mazout2_to_kgGES+M12*IF(U_Prop=\"[l]\",L_Propane_to_kgGES,Conversion!$H$37)+O12*kg_Bois8_to_kgGES+Q12*kg_Bois35_to_kgGES+S12*lbs_vapeur_to_kgGES+U12*MBTU_eaurefroidie_to_kgGES+W12*MBTU_eauchaude_to_kgGES)/1000","v":0},0,0.7,{"$f":"SUM(AE9:AE11)","v":450.6},9]
["2012-08-01",null,null,null,null,null,null,null,null,null,null,null,null,null,null,null,null,null,null,null,null,null,null,null,0,0,"","",{"$f":"(C13*kWh_Élect_to_kgGES+E13*IF(U_GNat=\"[m³]\",m3_GazNat_to_kgGES,Conversion!$H$29)+G13*IF(U_Ma2=\"[l]\",L_Mazout2_to_kgGES,Conversion!$H$31)+I13*IF(U_Ma6=\"[l]\",L_Mazout6_to_kgGES,Conversion!$H$33)+K13*L_Mazout2_to_kgGES+M13*IF(U_Prop=\"[l]\",L_Propane_to_kgGES,Conversion!$H$37)+O13*kg_Bois8_to_kgGES+Q13*kg_Bois35_to_kgGES+S13*lbs_vapeur_to_kgGES+U13*MBTU_eaurefroidie_to_kgGES+W13*MBTU_eauchaude_to_kgGES)/1000","v":0},0,0.8,{"$f":"SUM(AE9:AE12)","v":451.3},8]
["2012-09-01",null,null,null,null,null,null,null,null,null,null,null,null,null,null,null,null,null,null,null,null,null,null,null,0,0,"","",{"$f":"(C14*kWh_Élect_to_kgGES+E14*IF(U_GNat=\"[m³]\",m3_GazNat_to_kgGES,Conversion!$H$29)+G14*IF(U_Ma2=\"[l]\",L_Mazout2_to_kgGES,Conversion!$H$31)+I14*IF(U_Ma6=\"[l]\",L_Mazout6_to_kgGES,Conversion!$H$33)+K14*L_Mazout2_to_kgGES+M14*IF(U_Prop=\"[l]\",L_Propane_to_kgGES,Conversion!$H$37)+O14*kg_Bois8_to_kgGES+Q14*kg_Bois35_to_kgGES+S14*lbs_vapeur_to_kgGES+U14*MBTU_eaurefroidie_to_kgGES+W14*MBTU_eauchaude_to_kgGES)/1000","v":0},0,92.5,{"$f":"SUM(AE9:AE13)","v":452.1},7]
["2012-10-01",null,null,null,null,null,null,null,null,null,null,null,null,null,null,null,null,null,null,null,null,null,null,null,0,0,"","",{"$f":"(C15*kWh_Élect_to_kgGES+E15*IF(U_GNat=\"[m³]\",m3_GazNat_to_kgGES,Conversion!$H$29)+G15*IF(U_Ma2=\"[l]\",L_Mazout2_to_kgGES,Conversion!$H$31)+I15*IF(U_Ma6=\"[l]\",L_Mazout6_to_kgGES,Conversion!$H$33)+K15*L_Mazout2_to_kgGES+M15*IF(U_Prop=\"[l]\",L_Propane_to_kgGES,Conversion!$H$37)+O15*kg_Bois8_to_kgGES+Q15*kg_Bois35_to_kgGES+S15*lbs_vapeur_to_kgGES+U15*MBTU_eaurefroidie_to_kgGES+W15*MBTU_eauchaude_to_kgGES)/1000","v":0},0,222.8,{"$f":"SUM(AE9:AE14)","v":544.6},6]
["2012-11-01",null,null,null,null,null,null,null,null,null,null,null,null,null,null,null,null,null,null,null,null,null,null,null,0,0,"","",{"$f":"(C16*kWh_Élect_to_kgGES+E16*IF(U_GNat=\"[m³]\",m3_GazNat_to_kgGES,Conversion!$H$29)+G16*IF(U_Ma2=\"[l]\",L_Mazout2_to_kgGES,Conversion!$H$31)+I16*IF(U_Ma6=\"[l]\",L_Mazout6_to_kgGES,Conversion!$H$33)+K16*L_Mazout2_to_kgGES+M16*IF(U_Prop=\"[l]\",L_Propane_to_kgGES,Conversion!$H$37)+O16*kg_Bois8_to_kgGES+Q16*kg_Bois35_to_kgGES+S16*lbs_vapeur_to_kgGES+U16*MBTU_eaurefroidie_to_kgGES+W16*MBTU_eauchaude_to_kgGES)/1000","v":0},0,524.20000000000005,{"$f":"SUM(AE9:AE15)","v":767.40000000000009},5]
["2012-12-01",null,null,null,null,null,null,null,null,null,null,null,null,null,null,null,null,null,null,null,null,null,null,null,0,0,"","",{"$f":"(C17*kWh_Élect_to_kgGES+E17*IF(U_GNat=\"[m³]\",m3_GazNat_to_kgGES,Conversion!$H$29)+G17*IF(U_Ma2=\"[l]\",L_Mazout2_to_kgGES,Conversion!$H$31)+I17*IF(U_Ma6=\"[l]\",L_Mazout6_to_kgGES,Conversion!$H$33)+K17*L_Mazout2_to_kgGES+M17*IF(U_Prop=\"[l]\",L_Propane_to_kgGES,Conversion!$H$37)+O17*kg_Bois8_to_kgGES+Q17*kg_Bois35_to_kgGES+S17*lbs_vapeur_to_kgGES+U17*MBTU_eaurefroidie_to_kgGES+W17*MBTU_eauchaude_to_kgGES)/1000","v":0},0,666.5,{"$f":"SUM(AE9:AE16)","v":1291.6000000000001},4]
["2013-01-01",null,null,null,null,null,null,null,null,null,null,null,null,null,null,null,null,null,null,null,null,null,null,null,0,0,"","",{"$f":"(C18*kWh_Élect_to_kgGES+E18*IF(U_GNat=\"[m³]\",m3_GazNat_to_kgGES,Conversion!$H$29)+G18*IF(U_Ma2=\"[l]\",L_Mazout2_to_kgGES,Conversion!$H$31)+I18*IF(U_Ma6=\"[l]\",L_Mazout6_to_kgGES,Conversion!$H$33)+K18*L_Mazout2_to_kgGES+M18*IF(U_Prop=\"[l]\",L_Propane_to_kgGES,Conversion!$H$37)+O18*kg_Bois8_to_kgGES+Q18*kg_Bois35_to_kgGES+S18*lbs_vapeur_to_kgGES+U18*MBTU_eaurefroidie_to_kgGES+W18*MBTU_eauchaude_to_kgGES)/1000","v":0},0,808.2,{"$f":"SUM(AE9:AE17)","v":1958.1000000000001},3]
["2013-02-01",null,null,null,null,null,null,null,null,null,null,null,null,null,null,null,null,null,null,null,null,null,null,null,0,0,"","",{"$f":"(C19*kWh_Élect_to_kgGES+E19*IF(U_GNat=\"[m³]\",m3_GazNat_to_kgGES,Conversion!$H$29)+G19*IF(U_Ma2=\"[l]\",L_Mazout2_to_kgGES,Conversion!$H$31)+I19*IF(U_Ma6=\"[l]\",L_Mazout6_to_kgGES,Conversion!$H$33)+K19*L_Mazout2_to_kgGES+M19*IF(U_Prop=\"[l]\",L_Propane_to_kgGES,Conversion!$H$37)+O19*kg_Bois8_to_kgGES+Q19*kg_Bois35_to_kgGES+S19*lbs_vapeur_to_kgGES+U19*MBTU_eaurefroidie_to_kgGES+W19*MBTU_eauchaude_to_kgGES)/1000","v":0},0,698,{"$f":"SUM(AE9:AE18)","v":2766.3},2]
["2013-03-01",null,null,null,null,null,null,null,null,null,null,null,null,null,null,null,null,null,null,null,null,null,null,null,0,0,"","",{"$f":"(C20*kWh_Élect_to_kgGES+E20*IF(U_GNat=\"[m³]\",m3_GazNat_to_kgGES,Conversion!$H$29)+G20*IF(U_Ma2=\"[l]\",L_Mazout2_to_kgGES,Conversion!$H$31)+I20*IF(U_Ma6=\"[l]\",L_Mazout6_to_kgGES,Conversion!$H$33)+K20*L_Mazout2_to_kgGES+M20*IF(U_Prop=\"[l]\",L_Propane_to_kgGES,Conversion!$H$37)+O20*kg_Bois8_to_kgGES+Q20*kg_Bois35_to_kgGES+S20*lbs_vapeur_to_kgGES+U20*MBTU_eaurefroidie_to_kgGES+W20*MBTU_eauchaude_to_kgGES)/1000","v":0},0,575.1,{"$f":"SUM(AE9:AE19)","v":3464.3},1]
["TOTAL/moyenne",{"$f":"IF(ISERROR(AVERAGE(B9:B20)),0,AVERAGE(B9:B20))","v":0},{"$f":"SUM(C9:C20)","v":0},0,0,0,0,0,0,0,0,0,0,0,0,0,0,0,0,0,0,0,0,0,0,{"$f":"D21+F21+H21+J21+L21+N21+P21+R21+T21+V21+X21","v":0},{"$f":"IF(ISERROR(Y21/B21),\"\",Y21/B21)","v":""},{"$f":"IF(ISERROR(Z21/B21),\"\",Z21/B21)","v":""},{"$f":"(C21*kWh_Élect_to_kgGES+E21*IF(U_GNat=\"[m³]\",m3_GazNat_to_kgGES,Conversion!$H$29)+G21*IF(U_Ma2=\"[l]\",L_Mazout2_to_kgGES,Conversion!$H$31)+I21*IF(U_Ma6=\"[l]\",L_Mazout6_to_kgGES,Conversion!$H$33)+K21*L_Mazout2_to_kgGES+M21*IF(U_Prop=\"[l]\",L_Propane_to_kgGES,Conversion!$H$37)+O21*kg_Bois8_to_kgGES+Q21*kg_Bois35_to_kgGES+S21*lbs_vapeur_to_kgGES+U21*MBTU_eaurefroidie_to_kgGES+W21*MBTU_eauchaude_to_kgGES)/1000","v":0},{"$f":"(IF(ISERROR(AC21/B21),0,(AC21/B21)))*1000","v":0},{"$f":"SUM(AE9:AE20)","v":4039.4}]
[2012,"Sup_12-13","Elec_kWh_12-13","Elec_CAD_12-13","GN_m³_12-13","GN_CAD_12-13","Ma2_l_12-13","Ma2_CAD_12-13","Ma6_l_12-13","Ma6_CAD_12-13",null,null,"Prop_l_12-13","Prop_CAD_12-13","Bois20_1000kg_12-13","Bois20_CAD_12-13","Bois45_1000kg_12-13","Bois45_CAD_12-13",null,null,null,null,null,null,"GJ_Tot_12-13","CAD_Tot_12-13","GJm²_12-13","CAD/m²_12-13","GES_ton_12-13","GES_ton/m²_12-13","DJC_tot_12-13"]
["Nombre de bâtiments en propriété ou en location, pour lesquels des factures d'énergie sont payées par l'organisation :"]
[]
["ATTENTION, la saisie des consommations d'énergie comporte une erreur si la cellule AA21 est ombragée d'une couleur !",null,null,null,null,null,null,null,null,null,null,null,null,null,null,null,null,null,null,null,null,null,null,null,null,null,{"$f":"Lim_bas","v":0},{"$f":"Lim_haut","v":0}]
[]
["AJUSTEMENTS NON PÉRIODIQUES",null,"Un ajustement correspond à une modification majeure des équipements ou du bâtiment. Il peut avoir un effet positif ou négatif sur la consommation énergétique : \n- un effet positif correspond à une augmentation majeure de la consommation, à la suite par exemple de l'ajout d'un étage de bâtiment ou de l'ajout de climatisation d'une aile d'un bâtiment;\n- un effet négatif correspond à une diminution majeure de la consommation. Cette diminution ne résulte pas forcément d’une économie provenant d’une optimisation du bâtiment.  Elle peut, par exemple, être attribuable à la fermeture d’une partie d'un bâtiment qui devient alors inoccupé.                                                                                                                                                                                                                                                 \n\nExemple :\nL'ajout de locaux implique une augmentation nette des charges de chauffage et d'éclairage de 500 kWh, telles qu’elles sont calculées par une firme d'ingénieurs. Dans ce fichier, le projet, qui sera nommé « Agrandissement », impliquera une augmentation de l'électricité de 500 kWh. Comme il s'agit de chauffage, l'ajustement y est sensible. La date d'implantation correspond au mois où l’effet sur la consommation a été effectif.\nSi l'ajustement a eu un effet sur plus qu'une source d'énergie, merci de rajouter une ligne pour chaque source touchée."]
[]
[null,"Projet","Tendance de l'impact","Source d'énergie touchée","Impact Annuel",null,"Ajustement sensible au chauffage","Date d'implantation","Impact pour l'année complète [GJ]","Impact pour l'année en cours [GJ]",null,null,null,null,null,null,null,null,null,null,null,null,null,"Énergie de l'année de référence ajustée",{"$f":"((1-Facteur_variable)+Facteur_variable*DJC_tot_12_13/DJC_tot_09_10)*GJ_Tot_09_10+GJ_Ajust_NP_Cour_12_13","v":0},"GJTotRef_Ajust_12_13"]
[null,"Nom du projet no1",null,null,null,{"$f":"IF(D30=\"électrique\",\"kWh\",IF(D30=\"Gaz naturel\",\"m³\",IF(LEFT(D30,1)=\"R\",\"1000 kg\",\"l\")))","v":"l"},null,null,{"$f":"IF(COUNTA(G30)=1,IF(C30=\"Réduction\",-1,IF(C30=\"Augmentation\",1,0))*E30*INDEX(Conversion!$A$26:$J$42,MATCH(D30,Conversion!$J$26:$J$42,0),9),0)","v":0},{"$f":"IF(G30=\"Non\",I30*L30,IF(G30=\"Oui\",I30*K30,0))","v":0},{"$f":"(DJC_tot_12_13-INDEX($A$9:$AF$20,MATCH(H30,$A$9:$A$20,0),24))/DJC_tot_12_13","v":{"$error":"#N/A"}},{"$f":"INDEX($A$9:$AG$20,MATCH(H30,$A$9:$A$20,0),25)/12","v":{"$error":"#N/A"}},null,null,null,null,null,null,null,null,null,null,null,"Énergie de l'année de suivi",{"$f":"GJ_Tot_12_13","v":0}]
[null,"Nom du projet no2",null,null,null,{"$f":"IF(D31=\"électrique\",\"kWh\",IF(D31=\"Gaz naturel\",\"m³\",IF(LEFT(D31,1)=\"R\",\"1000 kg\",\"l\")))","v":"l"},null,null,{"$f":"IF(COUNTA(G31)=1,IF(C31=\"Réduction\",-1,IF(C31=\"Augmentation\",1,0))*E31*INDEX(Conversion!$A$26:$J$42,MATCH(D31,Conversion!$J$26:$J$42,0),9),0)","v":0},0,{"$error":"#N/A"},{"$error":"#N/A"},null,null,null,null,null,null,null,null,null,null,null,"Superficie de l'année de référence",{"$f":"Sup_09_10","v":0}]
[null,"Nom du projet no3",null,null,null,"l",null,null,{"$f":"IF(COUNTA(G32)=1,IF(C32=\"Réduction\",-1,IF(C32=\"Augmentation\",1,0))*E32*INDEX(Conversion!$A$26:$J$42,MATCH(D32,Conversion!$J$26:$J$42,0),9),0)","v":0},0,{"$error":"#N/A"},{"$error":"#N/A"},null,null,null,null,null,null,null,null,null,null,null,"Superficie de l'année de suivi",{"$f":"Sup_12_13","v":0}]
[null,"Nom du projet no4",null,null,null,"l",null,null,{"$f":"IF(COUNTA(G33)=1,IF(C33=\"Réduction\",-1,IF(C33=\"Augmentation\",1,0))*E33*INDEX(Conversion!$A$26:$J$42,MATCH(D33,Conversion!$J$26:$J$42,0),9),0)","v":0},0,{"$error":"#N/A"},{"$error":"#N/A"},null,null,null,null,null,null,null,null,null,null,null,null,{"$f":"GJTotRef_Ajust_12_13/Sup_09_10","v":{"$error":"#DIV/0!"}},"GJTotRef_Ajust_m²_12_13"]
[null,"Nom du projet no5",null,null,null,"l",null,null,{"$f":"IF(COUNTA(G34)=1,IF(C34=\"Réduction\",-1,IF(C34=\"Augmentation\",1,0))*E34*INDEX(Conversion!$A$26:$J$42,MATCH(D34,Conversion!$J$26:$J$42,0),9),0)","v":0},0,{"$error":"#N/A"},{"$error":"#N/A"},null,null,null,null,null,null,null,null,null,null,null,null,{"$f":"J37","v":0},"GJ_Ajust_NP_Cour_12_13"]
[null,"Nom du projet no6",null,null,null,"l",null,null,{"$f":"IF(COUNTA(G35)=1,IF(C35=\"Réduction\",-1,IF(C35=\"Augmentation\",1,0))*E35*INDEX(Conversion!$A$26:$J$42,MATCH(D35,Conversion!$J$26:$J$42,0),9),0)","v":0},0,{"$error":"#N/A"},{"$error":"#N/A"},null,null,null,null,null,null,null,null,null,null,null,null,{"$f":"I37","v":0},"GJ_Ajust_NP_annuel_12_13"]
[null,"Nom du projet no7",null,null,null,"l",null,null,{"$f":"IF(COUNTA(G36)=1,IF(C36=\"Réduction\",-1,IF(C36=\"Augmentation\",1,0))*E36*INDEX(Conversion!$A$26:$J$42,MATCH(D36,Conversion!$J$26:$J$42,0),9),0)","v":0},0,{"$error":"#N/A"},{"$error":"#N/A"}]
[null,"TOTAL",null,null,null,null,null,null,{"$f":"SUM(I30:I36)","v":0},{"$f":"SUM(J30:J36)","v":0}]
[]
[]
[]
[]
[]
[]
[]
[]
[null,null,"Réduction","Électrique",null,null,"Oui"]
[null,null,"Augmentation","Gaz naturel",null,null,"Non"]
[null,null,null,"Mazout n°2"]
[null,null,null,"Mazout n°6"]
[null,null,null,"Propane"]
[null,null,null,"Résidus de bois (20%humidité)"]
[null,null,null,"Résidus de bois (45%humidité)"]
[null,null,null,"-"]

{"sheet":"2013-2014","index":6,"n_rows":53,"n_cols":33,"rows_kept":53,"cut":false,"hidden":false,"merged":[[6,12,6,13],[6,18,6,19],[6,20,6,21],[6,28,6,29],[6,14,6,15],[6,22,6,23],[6,16,6,17],[6,24,6,25],[6,26,6,27],[26,0,26,1],[26,2,26,11],[6,0,7,0],[6,2,6,3],[6,4,6,5],[6,6,6,7],[6,10,6,11],[24,0,24,7],[6,8,6,9]]}
[null,null,"Système de suivi de la consommation énergétique dans les bâtiments"]
[null,null,null,"Saisir les données énergétiques et les données sur les dépenses annuelles, avant taxes, dans les cellules ombragées en bleu pâle."]
[]
[null,null,null,"Dans le cas où un projet ayant un effet sur la consommation énergétique a eu lieu au cours de l'année (rénovation, agrandissement, etc.), "]
[null,null,null,"veuillez remplir la section « AJUSTEMENTS NON PÉRIODIQUES », ci-dessous."]
[]
["<-- Résumé","Superficie","Consommation électrique",null,"Gaz naturel",null,"Mazout n°2 ",null,"Mazout n°6",null,"Diesel (génératrice)",null,"Propane",null,"Résidus de bois\n (20 % d'humidité)",null,"Résidus de bois\n(45 % d'humidité)",null,"Vapeur",null,"Eau refroidie",null,"Eau chaude",null,"TOTAL",null,"Intensité énergétique",null,"GES",null,"DJC"]
[null,"[m²]","[kWh]","[$]","[m³]","[$]","[l]","[$]","[l]","[$]","[l]","[$]","[l]","[$]","[1000 kg MG]","[$]","[1000 kg MG]","[$]","[lbs]","[$]","[MBTU]","[$]","[MBTU]","[$]"," [GJ]","[$]","[GJ/m²]","[$/m²]","[t CO2 éq.]","[kg CO2 éq./m²]"," [° C]"]
[{"$f":"VALUE(CONCATENATE(LEFT(Annee_financiere,FIND(\"-\",Annee_financiere)-1),\"-\",A22))","v":"2013-04-01"},null,null,null,null,null,null,null,null,null,null,null,null,null,null,null,null,null,null,null,null,null,null,null,{"$f":"C9*kWh_Élect_to_GJ+E9*m3_GazNat_to_GJ+G9*L_Mazout2_to_GJ+I9*L_Mazout6_to_GJ+K9*L_Mazout2_to_GJ+M9*L_Propane_to_GJ+O9*kg_Bois8_to_GJ+Q9*kg_Bois35_to_GJ+S9*lbs_vapeur_to_GJ+U9*MBTU_eaurefroidie_to_GJ+W9*MBTU_eauchaude_to_GJ","v":0},{"$f":"D9+F9+H9+J9+N9+P9+R9+T9+V9+X9+L9","v":0},{"$f":"IF(ISERROR(Y9/B9),\"\",Y9/B9)","v":""},{"$f":"IF(ISERROR(Z9/B9),\"\",Z9/B9)","v":""},{"$f":"(C9*kWh_Élect_to_kgGES+E9*IF(U_GNat=\"[m³]\",m3_GazNat_to_kgGES,Conversion!$H$29)+G9*IF(U_Ma2=\"[l]\",L_Mazout2_to_kgGES,Conversion!$H$31)+I9*IF(U_Ma6=\"[l]\",L_Mazout6_to_kgGES,Conversion!$H$33)+K9*L_Mazout2_to_kgGES+M9*IF(U_Prop=\"[l]\",L_Propane_to_kgGES,Conversion!$H$37)+O9*kg_Bois8_to_kgGES+Q9*kg_Bois35_to_kgGES+S9*lbs_vapeur_to_kgGES+U9*MBTU_eaurefroidie_to_kgGES+W9*MBTU_eauchaude_to_kgGES)/1000","v":0},{"$f":"(IF(ISERROR(AC9/B9),0,(AC9/B9)))*1000","v":0},{"$f":"INDEX(plage_DJ,MATCH(A9,plage_date),3)","v":358.6},null,12]
[{"$f":"DATE(YEAR(A9),MONTH(A9)+1,DAY(A9))","v":"2013-05-01"},null,null,null,null,null,null,null,null,null,null,null,null,null,null,null,null,null,null,null,null,null,null,null,0,{"$f":"D10+F10+H10+J10+N10+P10+R10+T10+V10+X10+L10","v":0},{"$f":"IF(ISERROR(Y10/B10),\"\",Y10/B10)","v":""},{"$f":"IF(ISERROR(Z10/B10),\"\",Z10/B10)","v":""},{"$f":"(C10*kWh_Élect_to_kgGES+E10*IF(U_GNat=\"[m³]\",m3_GazNat_to_kgGES,Conversion!$H$29)+G10*IF(U_Ma2=\"[l]\",L_Mazout2_to_kgGES,Conversion!$H$31)+I10*IF(U_Ma6=\"[l]\",L_Mazout6_to_kgGES,Conversion!$H$33)+K10*L_Mazout2_to_kgGES+M10*IF(U_Prop=\"[l]\",L_Propane_to_kgGES,Conversion!$H$37)+O10*kg_Bois8_to_kgGES+Q10*kg_Bois35_to_kgGES+S10*lbs_vapeur_to_kgGES+U10*MBTU_eaurefroidie_to_kgGES+W10*MBTU_eauchaude_to_kgGES)/1000","v":0},{"$f":"(IF(ISERROR(AC10/B10),0,(AC10/B10)))*1000","v":0},106.5,{"$f":"SUM(AE9)","v":358.6},11]
[{"$f":"DATE(YEAR(A10),MONTH(A10)+1,DAY(A10))","v":"2013-06-01"},null,null,null,null,null,null,null,null,null,null,null,null,null,null,null,null,null,null,null,null,null,null,null,0,0,"","",{"$f":"(C11*kWh_Élect_to_kgGES+E11*IF(U_GNat=\"[m³]\",m3_GazNat_to_kgGES,Conversion!$H$29)+G11*IF(U_Ma2=\"[l]\",L_Mazout2_to_kgGES,Conversion!$H$31)+I11*IF(U_Ma6=\"[l]\",L_Mazout6_to_kgGES,Conversion!$H$33)+K11*L_Mazout2_to_kgGES+M11*IF(U_Prop=\"[l]\",L_Propane_to_kgGES,Conversion!$H$37)+O11*kg_Bois8_to_kgGES+Q11*kg_Bois35_to_kgGES+S11*lbs_vapeur_to_kgGES+U11*MBTU_eaurefroidie_to_kgGES+W11*MBTU_eauchaude_to_kgGES)/1000","v":0},0,47.7,{"$f":"SUM(AE9:AE10)","v":465.1},10]
["2013-07-01",null,null,null,null,null,null,null,null,null,null,null,null,null,null,null,null,null,null,null,null,null,null,null,0,0,"","",{"$f":"(C12*kWh_Élect_to_kgGES+E12*IF(U_GNat=\"[m³]\",m3_GazNat_to_kgGES,Conversion!$H$29)+G12*IF(U_Ma2=\"[l]\",L_Mazout2_to_kgGES,Conversion!$H$31)+I12*IF(U_Ma6=\"[l]\",L_Mazout6_to_kgGES,Conversion!$H$33)+K12*L_Mazout2_to_kgGES+M12*IF(U_Prop=\"[l]\",L_Propane_to_kgGES,Conversion!$H$37)+O12*kg_Bois8_to_kgGES+Q12*kg_Bois35_to_kgGES+S12*lbs_vapeur_to_kgGES+U12*MBTU_eaurefroidie_to_kgGES+W12*MBTU_eauchaude_to_kgGES)/1000","v":0},0,4.0999999999999996,{"$f":"SUM(AE9:AE11)","v":512.80000000000007},9]
["2013-08-01",null,null,null,null,null,null,null,null,null,null,null,null,null,null,null,null,null,null,null,null,null,null,null,0,0,"","",{"$f":"(C13*kWh_Élect_to_kgGES+E13*IF(U_GNat=\"[m³]\",m3_GazNat_to_kgGES,Conversion!$H$29)+G13*IF(U_Ma2=\"[l]\",L_Mazout2_to_kgGES,Conversion!$H$31)+I13*IF(U_Ma6=\"[l]\",L_Mazout6_to_kgGES,Conversion!$H$33)+K13*L_Mazout2_to_kgGES+M13*IF(U_Prop=\"[l]\",L_Propane_to_kgGES,Conversion!$H$37)+O13*kg_Bois8_to_kgGES+Q13*kg_Bois35_to_kgGES+S13*lbs_vapeur_to_kgGES+U13*MBTU_eaurefroidie_to_kgGES+W13*MBTU_eauchaude_to_kgGES)/1000","v":0},0,3.4,{"$f":"SUM(AE9:AE12)","v":516.90000000000009},8]
["2013-09-01",null,null,null,null,null,null,null,null,null,null,null,null,null,null,null,null,null,null,null,null,null,null,null,0,0,"","",{"$f":"(C14*kWh_Élect_to_kgGES+E14*IF(U_GNat=\"[m³]\",m3_GazNat_to_kgGES,Conversion!$H$29)+G14*IF(U_Ma2=\"[l]\",L_Mazout2_to_kgGES,Conversion!$H$31)+I14*IF(U_Ma6=\"[l]\",L_Mazout6_to_kgGES,Conversion!$H$33)+K14*L_Mazout2_to_kgGES+M14*IF(U_Prop=\"[l]\",L_Propane_to_kgGES,Conversion!$H$37)+O14*kg_Bois8_to_kgGES+Q14*kg_Bois35_to_kgGES+S14*lbs_vapeur_to_kgGES+U14*MBTU_eaurefroidie_to_kgGES+W14*MBTU_eauchaude_to_kgGES)/1000","v":0},0,99.5,{"$f":"SUM(AE9:AE13)","v":520.30000000000007},7]
["2013-10-01",null,null,null,null,null,null,null,null,null,null,null,null,null,null,null,null,null,null,null,null,null,null,null,0,0,"","",{"$f":"(C15*kWh_Élect_to_kgGES+E15*IF(U_GNat=\"[m³]\",m3_GazNat_to_kgGES,Conversion!$H$29)+G15*IF(U_Ma2=\"[l]\",L_Mazout2_to_kgGES,Conversion!$H$31)+I15*IF(U_Ma6=\"[l]\",L_Mazout6_to_kgGES,Conversion!$H$33)+K15*L_Mazout2_to_kgGES+M15*IF(U_Prop=\"[l]\",L_Propane_to_kgGES,Conversion!$H$37)+O15*kg_Bois8_to_kgGES+Q15*kg_Bois35_to_kgGES+S15*lbs_vapeur_to_kgGES+U15*MBTU_eaurefroidie_to_kgGES+W15*MBTU_eauchaude_to_kgGES)/1000","v":0},0,236.5,{"$f":"SUM(AE9:AE14)","v":619.80000000000007},6]
["2013-11-01",null,null,null,null,null,null,null,null,null,null,null,null,null,null,null,null,null,null,null,null,null,null,null,0,0,"","",{"$f":"(C16*kWh_Élect_to_kgGES+E16*IF(U_GNat=\"[m³]\",m3_GazNat_to_kgGES,Conversion!$H$29)+G16*IF(U_Ma2=\"[l]\",L_Mazout2_to_kgGES,Conversion!$H$31)+I16*IF(U_Ma6=\"[l]\",L_Mazout6_to_kgGES,Conversion!$H$33)+K16*L_Mazout2_to_kgGES+M16*IF(U_Prop=\"[l]\",L_Propane_to_kgGES,Conversion!$H$37)+O16*kg_Bois8_to_kgGES+Q16*kg_Bois35_to_kgGES+S16*lbs_vapeur_to_kgGES+U16*MBTU_eaurefroidie_to_kgGES+W16*MBTU_eauchaude_to_kgGES)/1000","v":0},0,514,{"$f":"SUM(AE9:AE15)","v":856.30000000000007},5]
["2013-12-01",null,null,null,null,null,null,null,null,null,null,null,null,null,null,null,null,null,null,null,null,null,null,null,0,0,"","",{"$f":"(C17*kWh_Élect_to_kgGES+E17*IF(U_GNat=\"[m³]\",m3_GazNat_to_kgGES,Conversion!$H$29)+G17*IF(U_Ma2=\"[l]\",L_Mazout2_to_kgGES,Conversion!$H$31)+I17*IF(U_Ma6=\"[l]\",L_Mazout6_to_kgGES,Conversion!$H$33)+K17*L_Mazout2_to_kgGES+M17*IF(U_Prop=\"[l]\",L_Propane_to_kgGES,Conversion!$H$37)+O17*kg_Bois8_to_kgGES+Q17*kg_Bois35_to_kgGES+S17*lbs_vapeur_to_kgGES+U17*MBTU_eaurefroidie_to_kgGES+W17*MBTU_eauchaude_to_kgGES)/1000","v":0},0,817.5,{"$f":"SUM(AE9:AE16)","v":1370.3000000000002},4]
["2014-01-01",null,null,null,null,null,null,null,null,null,null,null,null,null,null,null,null,null,null,null,null,null,null,null,0,0,"","",{"$f":"(C18*kWh_Élect_to_kgGES+E18*IF(U_GNat=\"[m³]\",m3_GazNat_to_kgGES,Conversion!$H$29)+G18*IF(U_Ma2=\"[l]\",L_Mazout2_to_kgGES,Conversion!$H$31)+I18*IF(U_Ma6=\"[l]\",L_Mazout6_to_kgGES,Conversion!$H$33)+K18*L_Mazout2_to_kgGES+M18*IF(U_Prop=\"[l]\",L_Propane_to_kgGES,Conversion!$H$37)+O18*kg_Bois8_to_kgGES+Q18*kg_Bois35_to_kgGES+S18*lbs_vapeur_to_kgGES+U18*MBTU_eaurefroidie_to_kgGES+W18*MBTU_eauchaude_to_kgGES)/1000","v":0},0,873.9,{"$f":"SUM(AE9:AE17)","v":2187.8000000000002},3]
["2014-02-01",null,null,null,null,null,null,null,null,null,null,null,null,null,null,null,null,null,null,null,null,null,null,null,0,0,"","",{"$f":"(C19*kWh_Élect_to_kgGES+E19*IF(U_GNat=\"[m³]\",m3_GazNat_to_kgGES,Conversion!$H$29)+G19*IF(U_Ma2=\"[l]\",L_Mazout2_to_kgGES,Conversion!$H$31)+I19*IF(U_Ma6=\"[l]\",L_Mazout6_to_kgGES,Conversion!$H$33)+K19*L_Mazout2_to_kgGES+M19*IF(U_Prop=\"[l]\",L_Propane_to_kgGES,Conversion!$H$37)+O19*kg_Bois8_to_kgGES+Q19*kg_Bois35_to_kgGES+S19*lbs_vapeur_to_kgGES+U19*MBTU_eaurefroidie_to_kgGES+W19*MBTU_eauchaude_to_kgGES)/1000","v":0},0,754.6,{"$f":"SUM(AE9:AE18)","v":3061.7000000000003},2]
["2014-03-01",null,null,null,null,null,null,null,null,null,null,null,null,null,null,null,null,null,null,null,null,null,null,null,0,0,"","",{"$f":"(C20*kWh_Élect_to_kgGES+E20*IF(U_GNat=\"[m³]\",m3_GazNat_to_kgGES,Conversion!$H$29)+G20*IF(U_Ma2=\"[l]\",L_Mazout2_to_kgGES,Conversion!$H$31)+I20*IF(U_Ma6=\"[l]\",L_Mazout6_to_kgGES,Conversion!$H$33)+K20*L_Mazout2_to_kgGES+M20*IF(U_Prop=\"[l]\",L_Propane_to_kgGES,Conversion!$H$37)+O20*kg_Bois8_to_kgGES+Q20*kg_Bois35_to_kgGES+S20*lbs_vapeur_to_kgGES+U20*MBTU_eaurefroidie_to_kgGES+W20*MBTU_eauchaude_to_kgGES)/1000","v":0},0,746.2,{"$f":"SUM(AE9:AE19)","v":3816.3},1]
["TOTAL/moyenne",{"$f":"IF(ISERROR(AVERAGE(B9:B20)),0,AVERAGE(B9:B20))","v":0},{"$f":"SUM(C9:C20)","v":0},{"$f":"SUM(D9:D20)","v":0},0,0,0,0,0,0,0,0,0,0,0,0,0,0,0,0,0,0,0,0,0,{"$f":"D21+F21+H21+J21+L21+N21+P21+R21+T21+V21+X21","v":0},{"$f":"IF(ISERROR(Y21/B21),\"\",Y21/B21)","v":""},{"$f":"IF(ISERROR(Z21/B21),\"\",Z21/B21)","v":""},{"$f":"(C21*kWh_Élect_to_kgGES+E21*IF(U_GNat=\"[m³]\",m3_GazNat_to_kgGES,Conversion!$H$29)+G21*IF(U_Ma2=\"[l]\",L_Mazout2_to_kgGES,Conversion!$H$31)+I21*IF(U_Ma6=\"[l]\",L_Mazout6_to_kgGES,Conversion!$H$33)+K21*L_Mazout2_to_kgGES+M21*IF(U_Prop=\"[l]\",L_Propane_to_kgGES,Conversion!$H$37)+O21*kg_Bois8_to_kgGES+Q21*kg_Bois35_to_kgGES+S21*lbs_vapeur_to_kgGES+U21*MBTU_eaurefroidie_to_kgGES+W21*MBTU_eauchaude_to_kgGES)/1000","v":0},{"$f":"(IF(ISERROR(AC21/B21),0,(AC21/B21)))*1000","v":0},{"$f":"SUM(AE9:AE20)","v":4562.5}]
[2013,"Sup_13-14","Elec_kWh_13-14","Elec_CAD_13-14","GN_m³_13-14","GN_CAD_13-14","Ma2_l_13-14","Ma2_CAD_13-14","Ma6_l_13-14","Ma6_CAD_13-14",null,null,"Prop_l_13-14","Prop_CAD_13-14","Bois20_1000kg_13-14","Bois20_CAD_13-14","Bois45_1000kg_13-14","Bois45_CAD_13-14",null,null,null,null,null,null,"GJ_Tot_13-14","CAD_Tot_13-14","GJm²_13-14","CAD/m²_13-14","GES_ton_13-14","GES_ton/m²_13-14","DJC_tot_13-14"]
["Nombre de bâtiments en propriété ou en location, pour lesquels des factures d'énergie sont payées par l'organisation :"]
[]
["ATTENTION, la saisie des consommations d'énergie comporte une erreur si la cellule AA21 est ombragée d'une couleur !",null,null,null,null,null,null,null,null,null,null,null,null,null,null,null,null,null,null,null,null,null,null,null,null,null,{"$f":"Lim_bas","v":0},{"$f":"Lim_haut","v":0}]
[]
["AJUSTEMENTS NON PÉRIODIQUES",null,"Un ajustement correspond à une modification majeure des équipements ou du bâtiment. Il peut avoir un effet positif ou négatif sur la consommation énergétique : \n- un effet positif correspond à une augmentation majeure de la consommation, à la suite par exemple de l'ajout d'un étage de bâtiment ou de l'ajout de climatisation d'une aile d'un bâtiment;\n- un effet négatif correspond à une diminution majeure de la consommation. Cette diminution ne résulte pas forcément d’une économie provenant d’une optimisation du bâtiment.  Elle peut, par exemple, être attribuable à la fermeture d’une partie d'un bâtiment qui devient alors inoccupé.                                                                                                                                                                                                                                                 \n\nExemple :\nL'ajout de locaux implique une augmentation nette des charges de chauffage et d'éclairage de 500 kWh, telles qu’elles sont calculées par une firme d'ingénieurs. Dans ce fichier, le projet, qui sera nommé « Agrandissement », impliquera une augmentation de l'électricité de 500 kWh. Comme il s'agit de chauffage, l'ajustement y est sensible. La date d'implantation correspond au mois où l’effet sur la consommation a été effectif.\nSi l'ajustement a eu un effet sur plus qu'une source d'énergie, merci de rajouter une ligne pour chaque source touchée."]
[]
[null,"Projet","Tendance de l'impact","Source d'énergie touchée","Impact Annuel",null,"Ajustement sensible au chauffage","Date d'implantation","Impact pour l'année complète [GJ]","Impact pour l'année en cours [GJ]",null,null,null,null,null,null,null,null,null,null,null,null,null,"Énergie de l'année de référence ajustée",{"$f":"((1-Facteur_variable)+Facteur_variable*DJC_tot_13_14/DJC_tot_09_10)*GJ_Tot_09_10+GJ_Ajust_NP_Cour_13_14","v":0},"GJTotRef_Ajust_13_14"]
[null,"Nom du projet no1",null,null,null,{"$f":"IF(D30=\"électrique\",\"kWh\",IF(D30=\"Gaz naturel\",\"m³\",IF(LEFT(D30,1)=\"R\",\"1000 kg\",\"l\")))","v":"l"},null,null,{"$f":"IF(COUNTA(G30)=1,IF(C30=\"Réduction\",-1,IF(C30=\"Augmentation\",1,0))*E30*INDEX(Conversion!$A$26:$J$42,MATCH(D30,Conversion!$J$26:$J$42,0),9),0)","v":0},{"$f":"IF(G30=\"Non\",I30*L30,IF(G30=\"Oui\",I30*K30,0))","v":0},{"$f":"(DJC_tot_13_14-INDEX($A$9:$AF$20,MATCH(H30,$A$9:$A$20,0),24))/DJC_tot_13_14","v":{"$error":"#N/A"}},{"$f":"INDEX($A$9:$AG$20,MATCH(H30,$A$9:$A$20,0),25)/12","v":{"$error":"#N/A"}},null,null,null,null,null,null,null,null,null,null,null,"Énergie de l'année de suivi",{"$f":"GJ_Tot_13_14","v":0}]
[null,"Nom du projet no2",null,null,null,{"$f":"IF(D31=\"électrique\",\"kWh\",IF(D31=\"Gaz naturel\",\"m³\",IF(LEFT(D31,1)=\"R\",\"1000 kg\",\"l\")))","v":"l"},null,null,{"$f":"IF(COUNTA(G31)=1,IF(C31=\"Réduction\",-1,IF(C31=\"Augmentation\",1,0))*E31*INDEX(Conversion!$A$26:$J$42,MATCH(D31,Conversion!$J$26:$J$42,0),9),0)","v":0},0,{"$error":"#N/A"},{"$error":"#N/A"},null,null,null,null,null,null,null,null,null,null,null,"Superficie de l'année de référence",{"$f":"Sup_09_10","v":0}]
[null,"Nom du projet no3",null,null,null,"l",null,null,{"$f":"IF(COUNTA(G32)=1,IF(C32=\"Réduction\",-1,IF(C32=\"Augmentation\",1,0))*E32*INDEX(Conversion!$A$26:$J$42,MATCH(D32,Conversion!$J$26:$J$42,0),9),0)","v":0},0,{"$error":"#N/A"},{"$error":"#N/A"},null,null,null,null,null,null,null,null,null,null,null,"Superficie de l'année de suivi",{"$f":"Sup_13_14","v":0}]
[null,"Nom du projet no4",null,null,null,"l",null,null,{"$f":"IF(COUNTA(G33)=1,IF(C33=\"Réduction\",-1,IF(C33=\"Augmentation\",1,0))*E33*INDEX(Conversion!$A$26:$J$42,MATCH(D33,Conversion!$J$26:$J$42,0),9),0)","v":0},0,{"$error":"#N/A"},{"$error":"#N/A"},null,null,null,null,null,null,null,null,null,null,null,null,{"$f":"GJTotRef_Ajust_13_14/Sup_09_10","v":{"$error":"#DIV/0!"}},"GJTotRef_Ajust_m²_13_14"]
[null,"Nom du projet no5",null,null,null,"l",null,null,{"$f":"IF(COUNTA(G34)=1,IF(C34=\"Réduction\",-1,IF(C34=\"Augmentation\",1,0))*E34*INDEX(Conversion!$A$26:$J$42,MATCH(D34,Conversion!$J$26:$J$42,0),9),0)","v":0},0,{"$error":"#N/A"},{"$error":"#N/A"},null,null,null,null,null,null,null,null,null,null,null,null,{"$f":"J37","v":0},"GJ_Ajust_NP_Cour_13_14"]
[null,"Nom du projet no6",null,null,null,"l",null,null,{"$f":"IF(COUNTA(G35)=1,IF(C35=\"Réduction\",-1,IF(C35=\"Augmentation\",1,0))*E35*INDEX(Conversion!$A$26:$J$42,MATCH(D35,Conversion!$J$26:$J$42,0),9),0)","v":0},0,{"$error":"#N/A"},{"$error":"#N/A"},null,null,null,null,null,null,null,null,null,null,null,null,{"$f":"I37","v":0},"GJ_Ajust_NP_annuel_13_14"]
[null,"Nom du projet no7",null,null,null,"l",null,null,{"$f":"IF(COUNTA(G36)=1,IF(C36=\"Réduction\",-1,IF(C36=\"Augmentation\",1,0))*E36*INDEX(Conversion!$A$26:$J$42,MATCH(D36,Conversion!$J$26:$J$42,0),9),0)","v":0},0,{"$error":"#N/A"},{"$error":"#N/A"}]
[null,"TOTAL",null,null,null,null,null,null,{"$f":"SUM(I30:I36)","v":0},{"$f":"SUM(J30:J36)","v":0}]
[]
[]
[]
[]
[]
[]
[]
[]
[null,null,"Réduction","Électrique",null,null,"Oui"]
[null,null,"Augmentation","Gaz naturel",null,null,"Non"]
[null,null,null,"Mazout n°2"]
[null,null,null,"Mazout n°6"]
[null,null,null,"Propane"]
[null,null,null,"Résidus de bois (20%humidité)"]
[null,null,null,"Résidus de bois (45%humidité)"]
[null,null,null,"-"]

{"sheet":"2014-2015","index":7,"n_rows":61,"n_cols":33,"rows_kept":61,"cut":false,"hidden":false,"merged":[[24,0,24,8],[34,0,34,1],[34,2,34,13],[6,12,6,13],[6,14,6,15],[6,0,7,0],[6,2,6,3],[6,4,6,5],[6,6,6,7],[6,8,6,9],[6,10,6,11],[6,24,6,25],[6,26,6,27],[6,28,6,29],[6,16,6,17],[6,18,6,19],[6,20,6,21],[6,22,6,23]]}
[null,null,"Système de suivi de la consommation énergétique dans les bâtiments"]
[null,null,null,"Saisir les données énergétiques et les données sur les dépenses annuelles, avant taxes, dans les cellules ombragées en bleu pâle."]
[null,null,null,"Pour les fins du MERN, la saisie mensuelle des données est optionnelle. Les espaces pour saisir mensuellement les données sont mises à la disposition des MO afin de leur permettre de suivre périodiquement la consommation."]
[null,null,null,"Dans le cas où un projet ayant un effet sur la consommation énergétique a eu lieu au cours de l'année (rénovation, agrandissement, etc.), "]
[null,null,null,"veuillez remplir la section « AJUSTEMENTS NON PÉRIODIQUES », ci-dessous."]
[]
["<-- Résumé","Superficie","Consommation électrique",null,"Gaz naturel",null,"Mazout n°2 ",null,"Mazout n°6",null,"Diesel (génératrice)",null,"Propane",null,"Résidus de bois\n (8% d'humidité)",null,"Résidus de bois\n(35% d'humidité)",null,"Vapeur",null,"Eau refroidie",null,"Eau chaude",null,"TOTAL",null,"Intensité Énergétique",null,"GES",null,"DJC"]
[null,"[m²]","[kWh]","[$]","[m³]","[$]","[l]","[$]","[l]","[$]","[l]","[$]","[l]","[$]","[1000 kg MG]","[$]","[1000 kg MG]","[$]","[lbs]","[$]","[MBTU]","[$]","[MBTU]","[$]"," [GJ]","[$]","[GJ/m²]","[$/m²]","[t CO2 éq.]","[kg CO2 éq./m²]"," [° C]"]
[{"$f":"VALUE(CONCATENATE(LEFT(Annee_financiere,FIND(\"-\",Annee_financiere)-1),\"-\",A22))","v":"2014-04-01"},null,null,null,null,null,null,null,null,null,null,null,null,null,null,null,null,null,null,null,null,null,null,null,{"$f":"C9*kWh_Élect_to_GJ+E9*m3_GazNat_to_GJ+G9*L_Mazout2_to_GJ+I9*L_Mazout6_to_GJ+K9*L_Mazout2_to_GJ+M9*L_Propane_to_GJ+O9*kg_Bois8_to_GJ+Q9*kg_Bois35_to_GJ+S9*lbs_vapeur_to_GJ+U9*MBTU_eaurefroidie_to_GJ+W9*MBTU_eauchaude_to_GJ","v":0},{"$f":"D9+F9+H9+J9+N9+P9+R9+T9+V9+X9+L9","v":0},{"$f":"IF(ISERROR(Y9/B9),\"\",Y9/B9)","v":""},{"$f":"IF(ISERROR(Z9/B9),\"\",Z9/B9)","v":""},{"$f":"(C9*kWh_Élect_to_kgGES+E9*IF(U_GNat=\"[m³]\",m3_GazNat_to_kgGES,Conversion!$H$29)+G9*IF(U_Ma2=\"[l]\",L_Mazout2_to_kgGES,Conversion!$H$31)+I9*IF(U_Ma6=\"[l]\",L_Mazout6_to_kgGES,Conversion!$H$33)+K9*L_Mazout2_to_kgGES+M9*IF(U_Prop=\"[l]\",L_Propane_to_kgGES,Conversion!$H$37)+O9*kg_Bois8_to_kgGES+Q9*kg_Bois35_to_kgGES+S9*lbs_vapeur_to_kgGES+U9*MBTU_eaurefroidie_to_kgGES+W9*MBTU_eauchaude_to_kgGES)/1000","v":0},{"$f":"(IF(ISERROR(AC9/B9),0,(AC9/B9)))*1000","v":0},{"$f":"INDEX(plage_DJ,MATCH(A9,plage_date),3)","v":368.1},null,12]
[{"$f":"DATE(YEAR(A9),MONTH(A9)+1,DAY(A9))","v":"2014-05-01"},null,null,null,null,null,null,null,null,null,null,null,null,null,null,null,null,null,null,null,null,null,null,null,0,{"$f":"D10+F10+H10+J10+N10+P10+R10+T10+V10+X10+L10","v":0},{"$f":"IF(ISERROR(Y10/B10),\"\",Y10/B10)","v":""},{"$f":"IF(ISERROR(Z10/B10),\"\",Z10/B10)","v":""},{"$f":"(C10*kWh_Élect_to_kgGES+E10*IF(U_GNat=\"[m³]\",m3_GazNat_to_kgGES,Conversion!$H$29)+G10*IF(U_Ma2=\"[l]\",L_Mazout2_to_kgGES,Conversion!$H$31)+I10*IF(U_Ma6=\"[l]\",L_Mazout6_to_kgGES,Conversion!$H$33)+K10*L_Mazout2_to_kgGES+M10*IF(U_Prop=\"[l]\",L_Propane_to_kgGES,Conversion!$H$37)+O10*kg_Bois8_to_kgGES+Q10*kg_Bois35_to_kgGES+S10*lbs_vapeur_to_kgGES+U10*MBTU_eaurefroidie_to_kgGES+W10*MBTU_eauchaude_to_kgGES)/1000","v":0},{"$f":"(IF(ISERROR(AC10/B10),0,(AC10/B10)))*1000","v":0},118.9,{"$f":"SUM(AE9)","v":368.1},11]
[{"$f":"DATE(YEAR(A10),MONTH(A10)+1,DAY(A10))","v":"2014-06-01"},null,null,null,null,null,null,null,null,null,null,null,null,null,null,null,null,null,null,null,null,null,null,null,0,0,"","",{"$f":"(C11*kWh_Élect_to_kgGES+E11*IF(U_GNat=\"[m³]\",m3_GazNat_to_kgGES,Conversion!$H$29)+G11*IF(U_Ma2=\"[l]\",L_Mazout2_to_kgGES,Conversion!$H$31)+I11*IF(U_Ma6=\"[l]\",L_Mazout6_to_kgGES,Conversion!$H$33)+K11*L_Mazout2_to_kgGES+M11*IF(U_Prop=\"[l]\",L_Propane_to_kgGES,Conversion!$H$37)+O11*kg_Bois8_to_kgGES+Q11*kg_Bois35_to_kgGES+S11*lbs_vapeur_to_kgGES+U11*MBTU_eaurefroidie_to_kgGES+W11*MBTU_eauchaude_to_kgGES)/1000","v":0},0,10.1,{"$f":"SUM(AE9:AE10)","v":487},10]
["2014-07-01",null,null,null,null,null,null,null,null,null,null,null,null,null,null,null,null,null,null,null,null,null,null,null,0,0,"","",{"$f":"(C12*kWh_Élect_to_kgGES+E12*IF(U_GNat=\"[m³]\",m3_GazNat_to_kgGES,Conversion!$H$29)+G12*IF(U_Ma2=\"[l]\",L_Mazout2_to_kgGES,Conversion!$H$31)+I12*IF(U_Ma6=\"[l]\",L_Mazout6_to_kgGES,Conversion!$H$33)+K12*L_Mazout2_to_kgGES+M12*IF(U_Prop=\"[l]\",L_Propane_to_kgGES,Conversion!$H$37)+O12*kg_Bois8_to_kgGES+Q12*kg_Bois35_to_kgGES+S12*lbs_vapeur_to_kgGES+U12*MBTU_eaurefroidie_to_kgGES+W12*MBTU_eauchaude_to_kgGES)/1000","v":0},0,2.9,{"$f":"SUM(AE9:AE11)","v":497.1},9]
["2014-08-01",null,null,null,null,null,null,null,null,null,null,null,null,null,null,null,null,null,null,null,null,null,null,null,0,0,"","",{"$f":"(C13*kWh_Élect_to_kgGES+E13*IF(U_GNat=\"[m³]\",m3_GazNat_to_kgGES,Conversion!$H$29)+G13*IF(U_Ma2=\"[l]\",L_Mazout2_to_kgGES,Conversion!$H$31)+I13*IF(U_Ma6=\"[l]\",L_Mazout6_to_kgGES,Conversion!$H$33)+K13*L_Mazout2_to_kgGES+M13*IF(U_Prop=\"[l]\",L_Propane_to_kgGES,Conversion!$H$37)+O13*kg_Bois8_to_kgGES+Q13*kg_Bois35_to_kgGES+S13*lbs_vapeur_to_kgGES+U13*MBTU_eaurefroidie_to_kgGES+W13*MBTU_eauchaude_to_kgGES)/1000","v":0},0,10.6,{"$f":"SUM(AE9:AE12)","v":500},8]
["2014-09-01",null,null,null,null,null,null,null,null,null,null,null,null,null,null,null,null,null,null,null,null,null,null,null,0,0,"","",{"$f":"(C14*kWh_Élect_to_kgGES+E14*IF(U_GNat=\"[m³]\",m3_GazNat_to_kgGES,Conversion!$H$29)+G14*IF(U_Ma2=\"[l]\",L_Mazout2_to_kgGES,Conversion!$H$31)+I14*IF(U_Ma6=\"[l]\",L_Mazout6_to_kgGES,Conversion!$H$33)+K14*L_Mazout2_to_kgGES+M14*IF(U_Prop=\"[l]\",L_Propane_to_kgGES,Conversion!$H$37)+O14*kg_Bois8_to_kgGES+Q14*kg_Bois35_to_kgGES+S14*lbs_vapeur_to_kgGES+U14*MBTU_eaurefroidie_to_kgGES+W14*MBTU_eauchaude_to_kgGES)/1000","v":0},0,97.6,{"$f":"SUM(AE9:AE13)","v":510.6},7]
["2014-10-01",null,null,null,null,null,null,null,null,null,null,null,null,null,null,null,null,null,null,null,null,null,null,null,0,0,"","",{"$f":"(C15*kWh_Élect_to_kgGES+E15*IF(U_GNat=\"[m³]\",m3_GazNat_to_kgGES,Conversion!$H$29)+G15*IF(U_Ma2=\"[l]\",L_Mazout2_to_kgGES,Conversion!$H$31)+I15*IF(U_Ma6=\"[l]\",L_Mazout6_to_kgGES,Conversion!$H$33)+K15*L_Mazout2_to_kgGES+M15*IF(U_Prop=\"[l]\",L_Propane_to_kgGES,Conversion!$H$37)+O15*kg_Bois8_to_kgGES+Q15*kg_Bois35_to_kgGES+S15*lbs_vapeur_to_kgGES+U15*MBTU_eaurefroidie_to_kgGES+W15*MBTU_eauchaude_to_kgGES)/1000","v":0},0,224.1,{"$f":"SUM(AE9:AE14)","v":608.20000000000005},6]
["2014-11-01",null,null,null,null,null,null,null,null,null,null,null,null,null,null,null,null,null,null,null,null,null,null,null,0,0,"","",{"$f":"(C16*kWh_Élect_to_kgGES+E16*IF(U_GNat=\"[m³]\",m3_GazNat_to_kgGES,Conversion!$H$29)+G16*IF(U_Ma2=\"[l]\",L_Mazout2_to_kgGES,Conversion!$H$31)+I16*IF(U_Ma6=\"[l]\",L_Mazout6_to_kgGES,Conversion!$H$33)+K16*L_Mazout2_to_kgGES+M16*IF(U_Prop=\"[l]\",L_Propane_to_kgGES,Conversion!$H$37)+O16*kg_Bois8_to_kgGES+Q16*kg_Bois35_to_kgGES+S16*lbs_vapeur_to_kgGES+U16*MBTU_eaurefroidie_to_kgGES+W16*MBTU_eauchaude_to_kgGES)/1000","v":0},0,484,{"$f":"SUM(AE9:AE15)","v":832.30000000000007},5]
["2014-12-01",null,null,null,null,null,null,null,null,null,null,null,null,null,null,null,null,null,null,null,null,null,null,null,0,0,"","",{"$f":"(C17*kWh_Élect_to_kgGES+E17*IF(U_GNat=\"[m³]\",m3_GazNat_to_kgGES,Conversion!$H$29)+G17*IF(U_Ma2=\"[l]\",L_Mazout2_to_kgGES,Conversion!$H$31)+I17*IF(U_Ma6=\"[l]\",L_Mazout6_to_kgGES,Conversion!$H$33)+K17*L_Mazout2_to_kgGES+M17*IF(U_Prop=\"[l]\",L_Propane_to_kgGES,Conversion!$H$37)+O17*kg_Bois8_to_kgGES+Q17*kg_Bois35_to_kgGES+S17*lbs_vapeur_to_kgGES+U17*MBTU_eaurefroidie_to_kgGES+W17*MBTU_eauchaude_to_kgGES)/1000","v":0},0,664.7,{"$f":"SUM(AE9:AE16)","v":1316.3000000000002},4]
["2015-01-01",null,null,null,null,null,null,null,null,null,null,null,null,null,null,null,null,null,null,null,null,null,null,null,0,0,"","",{"$f":"(C18*kWh_Élect_to_kgGES+E18*IF(U_GNat=\"[m³]\",m3_GazNat_to_kgGES,Conversion!$H$29)+G18*IF(U_Ma2=\"[l]\",L_Mazout2_to_kgGES,Conversion!$H$31)+I18*IF(U_Ma6=\"[l]\",L_Mazout6_to_kgGES,Conversion!$H$33)+K18*L_Mazout2_to_kgGES+M18*IF(U_Prop=\"[l]\",L_Propane_to_kgGES,Conversion!$H$37)+O18*kg_Bois8_to_kgGES+Q18*kg_Bois35_to_kgGES+S18*lbs_vapeur_to_kgGES+U18*MBTU_eaurefroidie_to_kgGES+W18*MBTU_eauchaude_to_kgGES)/1000","v":0},0,926.3,{"$f":"SUM(AE9:AE17)","v":1981.0000000000002},3]
["2015-02-01",null,null,null,null,null,null,null,null,null,null,null,null,null,null,null,null,null,null,null,null,null,null,null,0,0,"","",{"$f":"(C19*kWh_Élect_to_kgGES+E19*IF(U_GNat=\"[m³]\",m3_GazNat_to_kgGES,Conversion!$H$29)+G19*IF(U_Ma2=\"[l]\",L_Mazout2_to_kgGES,Conversion!$H$31)+I19*IF(U_Ma6=\"[l]\",L_Mazout6_to_kgGES,Conversion!$H$33)+K19*L_Mazout2_to_kgGES+M19*IF(U_Prop=\"[l]\",L_Propane_to_kgGES,Conversion!$H$37)+O19*kg_Bois8_to_kgGES+Q19*kg_Bois35_to_kgGES+S19*lbs_vapeur_to_kgGES+U19*MBTU_eaurefroidie_to_kgGES+W19*MBTU_eauchaude_to_kgGES)/1000","v":0},0,929.3,{"$f":"SUM(AE9:AE18)","v":2907.3},2]
["2015-03-01",null,null,null,null,null,null,null,null,null,null,null,null,null,null,null,null,null,null,null,null,null,null,null,0,0,"","",{"$f":"(C20*kWh_Élect_to_kgGES+E20*IF(U_GNat=\"[m³]\",m3_GazNat_to_kgGES,Conversion!$H$29)+G20*IF(U_Ma2=\"[l]\",L_Mazout2_to_kgGES,Conversion!$H$31)+I20*IF(U_Ma6=\"[l]\",L_Mazout6_to_kgGES,Conversion!$H$33)+K20*L_Mazout2_to_kgGES+M20*IF(U_Prop=\"[l]\",L_Propane_to_kgGES,Conversion!$H$37)+O20*kg_Bois8_to_kgGES+Q20*kg_Bois35_to_kgGES+S20*lbs_vapeur_to_kgGES+U20*MBTU_eaurefroidie_to_kgGES+W20*MBTU_eauchaude_to_kgGES)/1000","v":0},0,706.5,{"$f":"SUM(AE9:AE19)","v":3836.6000000000004},1]
["TOTAL/moyenne",{"$f":"IF(ISERROR(AVERAGE(B9:B20)),0,AVERAGE(B9:B20))","v":0},{"$f":"SUM(C9:C20)","v":0},{"$f":"SUM(D9:D20)","v":0},{"$f":"SUM(E9:E20)","v":0},0,0,0,0,0,0,0,0,0,0,0,0,0,0,0,0,0,0,0,0,{"$f":"D21+F21+H21+J21+L21+N21+P21+R21+T21+V21+X21","v":0},{"$f":"IF(ISERROR(Y21/B21),\"\",Y21/B21)","v":""},{"$f":"IF(ISERROR(Z21/B21),\"\",Z21/B21)","v":""},{"$f":"(C21*kWh_Élect_to_kgGES+E21*IF(U_GNat=\"[m³]\",m3_GazNat_to_kgGES,Conversion!$H$29)+G21*IF(U_Ma2=\"[l]\",L_Mazout2_to_kgGES,Conversion!$H$31)+I21*IF(U_Ma6=\"[l]\",L_Mazout6_to_kgGES,Conversion!$H$33)+K21*L_Mazout2_to_kgGES+M21*IF(U_Prop=\"[l]\",L_Propane_to_kgGES,Conversion!$H$37)+O21*kg_Bois8_to_kgGES+Q21*kg_Bois35_to_kgGES+S21*lbs_vapeur_to_kgGES+U21*MBTU_eaurefroidie_to_kgGES+W21*MBTU_eauchaude_to_kgGES)/1000","v":0},{"$f":"(IF(ISERROR(AC21/B21),0,(AC21/B21)))*1000","v":0},{"$f":"SUM(AE9:AE20)","v":4543.1000000000004}]
[2014,"Sup_14_15","Elec_kWh_14_15","Elec_CAD_14_15","GN_m³_14_15","GN_CAD_14_15","Ma2_l_14_15","Ma2_CAD_14_15","Ma6_l_14_15","Ma6_CAD_14_15",null,null,"Prop_l_14_15","Prop_CAD_14_15","Bois20_1000kg_14_15","Bois20_CAD_14_15","Bois45_1000kg_14_15","Bois45_CAD_14_15",null,null,null,null,null,null,"GJ_Tot_14_15","CAD_Tot_14_15","GJm²_14_15","CAD/m²_14_15","GES_ton_14_15","GES_ton/m²_14_15","DJC_tot_14_15"]
["Nombre de bâtiments en propriété ou location, pour lesquels des factures d'énergie sont payées par l'organisation :"]
[]
["ATTENTION, la saisie des consommations d'énergie comporte une erreur si la cellule AA21 est ombragée d'une couleur !",null,null,null,null,null,null,null,null,null,null,null,null,null,null,null,null,null,null,null,null,null,null,null,null,null,{"$f":"Lim_bas","v":0},{"$f":"Lim_haut","v":0}]
[]
["QUESTIONS SPÉCIFIQUES (cocher si applicable)"]
[]
["1."]
["2."]
["3."]
["4."]
["5."]
[]
["AJUSTEMENTS NON PÉRIODIQUE",null,"Un ajustement correspond à une modification majeure des équipements ou du bâtiment. Il peut avoir un effet positif ou négatif sur la consommation énergétique : \n- un effet positif correspond à une augmentation majeure de la consommation, à la suite par exemple de l'ajout d'un étage de bâtiment ou de l'ajout de climatisation d'une aile d'un bâtiment;\n- un effet négatif correspond à une diminution majeure de la consommation. Cette diminution ne résulte pas forcément d’une économie provenant d’une optimisation du bâtiment.  Elle peut, par exemple, être attribuable à la fermeture d’une partie d'un bâtiment qui devient alors inoccupé.                                                                                                                                                                                                                                                 \n\nExemple :\nL'ajout de locaux implique une augmentation nette des charges de chauffage et d'éclairage de 500 kWh, telles qu’elles sont calculées par une firme d'ingénieurs. Dans ce fichier, le projet, qui sera nommé « Agrandissement », impliquera une augmentation de l'électricité de 500 kWh. Comme il s'agit de chauffage, l'ajustement y est sensible. La date d'implantation correspond au mois où l’effet sur la consommation a été effectif.\nSi l'ajustement a eu un effet sur plus qu'une source d'énergie, merci de rajouter une ligne pour chaque source touchée."]
[]
[null,"Projet","Tendance de l'impact","Source d'énergie touchée","Impact Annuel",null,"Ajustement sensible au chauffage","Date d'implantation","Impact pour l'année complète [GJ]","Impact pour l'année en cours [GJ]",null,null,null,null,null,null,null,null,null,null,null,null,null,null,null,"Énergie de l'année de référence ajustée",{"$f":"((1-Facteur_variable)+Facteur_variable*DJC_tot_14_15/DJC_tot_09_10)*GJ_Tot_09_10+GJ_Ajust_NP_Cour_14_15","v":0},"GJTotRef_Ajust_14_15"]
[null,"Nom du projet no1",null,null,null,{"$f":"IF(D38=\"électrique\",\"kWh\",IF(D38=\"Gaz naturel\",\"m³\",IF(LEFT(D38,1)=\"R\",\"1000 kg\",\"l\")))","v":"l"},null,null,{"$f":"IF(COUNTA(G38)=1,IF(C38=\"Réduction\",-1,IF(C38=\"Augmentation\",1,0))*E38*INDEX(Conversion!$A$26:$J$42,MATCH(D38,Conversion!$J$26:$J$42,0),9),0)","v":0},{"$f":"IF(G38=\"Non\",I38*L38,IF(G38=\"Oui\",I38*K38,0))","v":0},{"$f":"(DJC_tot_15_16-INDEX($A$9:$AF$20,MATCH(H38,$A$9:$A$20,0),24))/DJC_tot_15_16","v":{"$error":"#N/A"}},{"$f":"INDEX($A$9:$AG$20,MATCH(H38,$A$9:$A$20,0),25)/12","v":{"$error":"#N/A"}},null,null,null,null,null,null,null,null,null,null,null,null,null,"Énergie de l'année de suivi",{"$f":"GJ_Tot_15_16","v":0}]
[null,"Nom du projet no2",null,null,null,{"$f":"IF(D39=\"électrique\",\"kWh\",IF(D39=\"Gaz naturel\",\"m³\",IF(LEFT(D39,1)=\"R\",\"1000 kg\",\"l\")))","v":"l"},null,null,{"$f":"IF(COUNTA(G39)=1,IF(C39=\"Réduction\",-1,IF(C39=\"Augmentation\",1,0))*E39*INDEX(Conversion!$A$26:$J$42,MATCH(D39,Conversion!$J$26:$J$42,0),9),0)","v":0},0,{"$error":"#N/A"},{"$error":"#N/A"},null,null,null,null,null,null,null,null,null,null,null,null,null,"Superficie de l'année de référence",{"$f":"Sup_09_10","v":0}]
[null,"Nom du projet no3",null,null,null,"l",null,null,{"$f":"IF(COUNTA(G40)=1,IF(C40=\"Réduction\",-1,IF(C40=\"Augmentation\",1,0))*E40*INDEX(Conversion!$A$26:$J$42,MATCH(D40,Conversion!$J$26:$J$42,0),9),0)","v":0},0,{"$error":"#N/A"},{"$error":"#N/A"},null,null,null,null,null,null,null,null,null,null,null,null,null,"Superficie de l'année de suivi",{"$f":"Sup_15_16","v":0}]
[null,"Nom du projet no4",null,null,null,"l",null,null,{"$f":"IF(COUNTA(G41)=1,IF(C41=\"Réduction\",-1,IF(C41=\"Augmentation\",1,0))*E41*INDEX(Conversion!$A$26:$J$42,MATCH(D41,Conversion!$J$26:$J$42,0),9),0)","v":0},0,{"$error":"#N/A"},{"$error":"#N/A"},null,null,null,null,null,null,null,null,null,null,null,null,null,null,{"$f":"GJTotRef_Ajust_14_15/Sup_09_10","v":{"$error":"#DIV/0!"}},"GJTotRef_Ajust_m²_14_15"]
[null,"Nom du projet no5",null,null,null,"l",null,null,{"$f":"IF(COUNTA(G42)=1,IF(C42=\"Réduction\",-1,IF(C42=\"Augmentation\",1,0))*E42*INDEX(Conversion!$A$26:$J$42,MATCH(D42,Conversion!$J$26:$J$42,0),9),0)","v":0},0,{"$error":"#N/A"},{"$error":"#N/A"},null,null,null,null,null,null,null,null,null,null,null,null,null,null,{"$f":"J45","v":0},"GJ_Ajust_NP_Cour_14_15"]
[null,"Nom du projet no6",null,null,null,"l",null,null,{"$f":"IF(COUNTA(G43)=1,IF(C43=\"Réduction\",-1,IF(C43=\"Augmentation\",1,0))*E43*INDEX(Conversion!$A$26:$J$42,MATCH(D43,Conversion!$J$26:$J$42,0),9),0)","v":0},0,{"$error":"#N/A"},{"$error":"#N/A"},null,null,null,null,null,null,null,null,null,null,null,null,null,null,{"$f":"I45","v":0},"GJ_Ajust_NP_annuel_14_15"]
[null,"Nom du projet no7",null,null,null,"l",null,null,{"$f":"IF(COUNTA(G44)=1,IF(C44=\"Réduction\",-1,IF(C44=\"Augmentation\",1,0))*E44*INDEX(Conversion!$A$26:$J$42,MATCH(D44,Conversion!$J$26:$J$42,0),9),0)","v":0},0,{"$error":"#N/A"},{"$error":"#N/A"}]
[null,"TOTAL",null,null,null,null,null,null,{"$f":"SUM(I38:I44)","v":0},{"$f":"SUM(J38:J44)","v":0}]
[]
[]
[]
[]
[]
[]
[]
[]
[null,null,"Réduction","Électrique",null,null,"Oui"]
[null,null,"Augmentation","Gaz naturel",null,null,"Non"]
[null,null,null,"Mazout n°2"]
[null,null,null,"Mazout n°6"]
[null,null,null,"Propane"]
[null,null,null,"Résidus de bois (20%humidité)"]
[null,null,null,"Résidus de bois (45%humidité)"]
[null,null,null,"-"]

{"sheet":"2015-2016","index":8,"n_rows":61,"n_cols":33,"rows_kept":61,"cut":false,"hidden":false,"merged":[[24,0,24,8],[34,0,34,1],[34,2,34,13],[6,12,6,13],[6,14,6,15],[6,0,7,0],[6,2,6,3],[6,4,6,5],[6,6,6,7],[6,8,6,9],[6,10,6,11],[6,24,6,25],[6,26,6,27],[6,28,6,29],[6,16,6,17],[6,18,6,19],[6,20,6,21],[6,22,6,23]]}
[null,null,"Système de suivi de la consommation énergétique dans les bâtiments"]
[null,null,null,"Saisir les données énergétiques et les données sur les dépenses annuelles, avant taxes, dans les cellules ombragées en bleu pâle."]
[null,null,null,"Pour les fins du MERN, la saisie mensuelle des données est optionnelle. Les espaces pour saisir mensuellement les données sont mises à la disposition des MO afin de leur permettre de suivre périodiquement la consommation."]
[null,null,null,"Dans le cas où un projet ayant un effet sur la consommation énergétique a eu lieu au cours de l'année (rénovation, agrandissement, etc.), "]
[null,null,null,"veuillez remplir la section « AJUSTEMENTS NON PÉRIODIQUES », ci-dessous."]
[]
["<-- Résumé","Superficie","Consommation électrique",null,"Gaz naturel",null,"Mazout n°2 ",null,"Mazout n°6",null,"Diesel (génératrice)",null,"Propane",null,"Résidus de bois\n (8% d'humidité)",null,"Résidus de bois\n(35% d'humidité)",null,"Vapeur",null,"Eau refroidie",null,"Eau chaude",null,"TOTAL",null,"Intensité Énergétique",null,"GES",null,"DJC"]
[null,"[m²]","[kWh]","[$]","[m³]","[$]","[l]","[$]","[l]","[$]","[l]","[$]","[l]","[$]","[1000 kg MG]","[$]","[1000 kg MG]","[$]","[lbs]","[$]","[MBTU]","[$]","[MBTU]","[$]"," [GJ]","[$]","[GJ/m²]","[$/m²]","[t CO2 éq.]","[kg CO2 éq./m²]"," [° C]"]
[{"$f":"VALUE(CONCATENATE(LEFT(Annee_financiere,FIND(\"-\",Annee_financiere)-1),\"-\",A22))","v":"2015-04-01"},null,null,null,null,null,null,null,null,null,null,null,null,null,null,null,null,null,null,null,null,null,null,null,{"$f":"C9*kWh_Élect_to_GJ+E9*m3_GazNat_to_GJ+G9*L_Mazout2_to_GJ+I9*L_Mazout6_to_GJ+K9*L_Mazout2_to_GJ+M9*L_Propane_to_GJ+O9*kg_Bois8_to_GJ+Q9*kg_Bois35_to_GJ+S9*lbs_vapeur_to_GJ+U9*MBTU_eaurefroidie_to_GJ+W9*MBTU_eauchaude_to_GJ","v":0},{"$f":"D9+F9+H9+J9+N9+P9+R9+T9+V9+X9+L9","v":0},{"$f":"IF(ISERROR(Y9/B9),\"\",Y9/B9)","v":""},{"$f":"IF(ISERROR(Z9/B9),\"\",Z9/B9)","v":""},{"$f":"(C9*kWh_Élect_to_kgGES+E9*IF(U_GNat=\"[m³]\",m3_GazNat_to_kgGES,Conversion!$H$29)+G9*IF(U_Ma2=\"[l]\",L_Mazout2_to_kgGES,Conversion!$H$31)+I9*IF(U_Ma6=\"[l]\",L_Mazout6_to_kgGES,Conversion!$H$33)+K9*L_Mazout2_to_kgGES+M9*IF(U_Prop=\"[l]\",L_Propane_to_kgGES,Conversion!$H$37)+O9*kg_Bois8_to_kgGES+Q9*kg_Bois35_to_kgGES+S9*lbs_vapeur_to_kgGES+U9*MBTU_eaurefroidie_to_kgGES+W9*MBTU_eauchaude_to_kgGES)/1000","v":0},{"$f":"(IF(ISERROR(AC9/B9),0,(AC9/B9)))*1000","v":0},{"$f":"INDEX(plage_DJ,MATCH(A9,plage_date),3)","v":351.6},null,12]
[{"$f":"DATE(YEAR(A9),MONTH(A9)+1,DAY(A9))","v":"2015-05-01"},null,null,null,null,null,null,null,null,null,null,null,null,null,null,null,null,null,null,null,null,null,null,null,0,{"$f":"D10+F10+H10+J10+N10+P10+R10+T10+V10+X10+L10","v":0},{"$f":"IF(ISERROR(Y10/B10),\"\",Y10/B10)","v":""},{"$f":"IF(ISERROR(Z10/B10),\"\",Z10/B10)","v":""},{"$f":"(C10*kWh_Élect_to_kgGES+E10*IF(U_GNat=\"[m³]\",m3_GazNat_to_kgGES,Conversion!$H$29)+G10*IF(U_Ma2=\"[l]\",L_Mazout2_to_kgGES,Conversion!$H$31)+I10*IF(U_Ma6=\"[l]\",L_Mazout6_to_kgGES,Conversion!$H$33)+K10*L_Mazout2_to_kgGES+M10*IF(U_Prop=\"[l]\",L_Propane_to_kgGES,Conversion!$H$37)+O10*kg_Bois8_to_kgGES+Q10*kg_Bois35_to_kgGES+S10*lbs_vapeur_to_kgGES+U10*MBTU_eaurefroidie_to_kgGES+W10*MBTU_eauchaude_to_kgGES)/1000","v":0},{"$f":"(IF(ISERROR(AC10/B10),0,(AC10/B10)))*1000","v":0},73,{"$f":"SUM(AE9)","v":351.6},11]
[{"$f":"DATE(YEAR(A10),MONTH(A10)+1,DAY(A10))","v":"2015-06-01"},null,null,null,null,null,null,null,null,null,null,null,null,null,null,null,null,null,null,null,null,null,null,null,0,0,"","",{"$f":"(C11*kWh_Élect_to_kgGES+E11*IF(U_GNat=\"[m³]\",m3_GazNat_to_kgGES,Conversion!$H$29)+G11*IF(U_Ma2=\"[l]\",L_Mazout2_to_kgGES,Conversion!$H$31)+I11*IF(U_Ma6=\"[l]\",L_Mazout6_to_kgGES,Conversion!$H$33)+K11*L_Mazout2_to_kgGES+M11*IF(U_Prop=\"[l]\",L_Propane_to_kgGES,Conversion!$H$37)+O11*kg_Bois8_to_kgGES+Q11*kg_Bois35_to_kgGES+S11*lbs_vapeur_to_kgGES+U11*MBTU_eaurefroidie_to_kgGES+W11*MBTU_eauchaude_to_kgGES)/1000","v":0},0,40.1,{"$f":"SUM(AE9:AE10)","v":424.6},10]
["2015-07-01",null,null,null,null,null,null,null,null,null,null,null,null,null,null,null,null,null,null,null,null,null,null,null,0,0,"","",{"$f":"(C12*kWh_Élect_to_kgGES+E12*IF(U_GNat=\"[m³]\",m3_GazNat_to_kgGES,Conversion!$H$29)+G12*IF(U_Ma2=\"[l]\",L_Mazout2_to_kgGES,Conversion!$H$31)+I12*IF(U_Ma6=\"[l]\",L_Mazout6_to_kgGES,Conversion!$H$33)+K12*L_Mazout2_to_kgGES+M12*IF(U_Prop=\"[l]\",L_Propane_to_kgGES,Conversion!$H$37)+O12*kg_Bois8_to_kgGES+Q12*kg_Bois35_to_kgGES+S12*lbs_vapeur_to_kgGES+U12*MBTU_eaurefroidie_to_kgGES+W12*MBTU_eauchaude_to_kgGES)/1000","v":0},0,1.1000000000000001,{"$f":"SUM(AE9:AE11)","v":464.70000000000005},9]
["2015-08-01",null,null,null,null,null,null,null,null,null,null,null,null,null,null,null,null,null,null,null,null,null,null,null,0,0,"","",{"$f":"(C13*kWh_Élect_to_kgGES+E13*IF(U_GNat=\"[m³]\",m3_GazNat_to_kgGES,Conversion!$H$29)+G13*IF(U_Ma2=\"[l]\",L_Mazout2_to_kgGES,Conversion!$H$31)+I13*IF(U_Ma6=\"[l]\",L_Mazout6_to_kgGES,Conversion!$H$33)+K13*L_Mazout2_to_kgGES+M13*IF(U_Prop=\"[l]\",L_Propane_to_kgGES,Conversion!$H$37)+O13*kg_Bois8_to_kgGES+Q13*kg_Bois35_to_kgGES+S13*lbs_vapeur_to_kgGES+U13*MBTU_eaurefroidie_to_kgGES+W13*MBTU_eauchaude_to_kgGES)/1000","v":0},0,0.9,{"$f":"SUM(AE9:AE12)","v":465.80000000000007},8]
["2015-09-01",null,null,null,null,null,null,null,null,null,null,null,null,null,null,null,null,null,null,null,null,null,null,null,0,0,"","",{"$f":"(C14*kWh_Élect_to_kgGES+E14*IF(U_GNat=\"[m³]\",m3_GazNat_to_kgGES,Conversion!$H$29)+G14*IF(U_Ma2=\"[l]\",L_Mazout2_to_kgGES,Conversion!$H$31)+I14*IF(U_Ma6=\"[l]\",L_Mazout6_to_kgGES,Conversion!$H$33)+K14*L_Mazout2_to_kgGES+M14*IF(U_Prop=\"[l]\",L_Propane_to_kgGES,Conversion!$H$37)+O14*kg_Bois8_to_kgGES+Q14*kg_Bois35_to_kgGES+S14*lbs_vapeur_to_kgGES+U14*MBTU_eaurefroidie_to_kgGES+W14*MBTU_eauchaude_to_kgGES)/1000","v":0},0,39.5,{"$f":"SUM(AE9:AE13)","v":466.70000000000005},7]
["2015-10-01",null,null,null,null,null,null,null,null,null,null,null,null,null,null,null,null,null,null,null,null,null,null,null,0,0,"","",{"$f":"(C15*kWh_Élect_to_kgGES+E15*IF(U_GNat=\"[m³]\",m3_GazNat_to_kgGES,Conversion!$H$29)+G15*IF(U_Ma2=\"[l]\",L_Mazout2_to_kgGES,Conversion!$H$31)+I15*IF(U_Ma6=\"[l]\",L_Mazout6_to_kgGES,Conversion!$H$33)+K15*L_Mazout2_to_kgGES+M15*IF(U_Prop=\"[l]\",L_Propane_to_kgGES,Conversion!$H$37)+O15*kg_Bois8_to_kgGES+Q15*kg_Bois35_to_kgGES+S15*lbs_vapeur_to_kgGES+U15*MBTU_eaurefroidie_to_kgGES+W15*MBTU_eauchaude_to_kgGES)/1000","v":0},0,311.7,{"$f":"SUM(AE9:AE14)","v":506.20000000000005},6]
["2015-11-01",null,null,null,null,null,null,null,null,null,null,null,null,null,null,null,null,null,null,null,null,null,null,null,0,0,"","",{"$f":"(C16*kWh_Élect_to_kgGES+E16*IF(U_GNat=\"[m³]\",m3_GazNat_to_kgGES,Conversion!$H$29)+G16*IF(U_Ma2=\"[l]\",L_Mazout2_to_kgGES,Conversion!$H$31)+I16*IF(U_Ma6=\"[l]\",L_Mazout6_to_kgGES,Conversion!$H$33)+K16*L_Mazout2_to_kgGES+M16*IF(U_Prop=\"[l]\",L_Propane_to_kgGES,Conversion!$H$37)+O16*kg_Bois8_to_kgGES+Q16*kg_Bois35_to_kgGES+S16*lbs_vapeur_to_kgGES+U16*MBTU_eaurefroidie_to_kgGES+W16*MBTU_eauchaude_to_kgGES)/1000","v":0},0,384.2,{"$f":"SUM(AE9:AE15)","v":817.90000000000009},5]
["2015-12-01",null,null,null,null,null,null,null,null,null,null,null,null,null,null,null,null,null,null,null,null,null,null,null,0,0,"","",{"$f":"(C17*kWh_Élect_to_kgGES+E17*IF(U_GNat=\"[m³]\",m3_GazNat_to_kgGES,Conversion!$H$29)+G17*IF(U_Ma2=\"[l]\",L_Mazout2_to_kgGES,Conversion!$H$31)+I17*IF(U_Ma6=\"[l]\",L_Mazout6_to_kgGES,Conversion!$H$33)+K17*L_Mazout2_to_kgGES+M17*IF(U_Prop=\"[l]\",L_Propane_to_kgGES,Conversion!$H$37)+O17*kg_Bois8_to_kgGES+Q17*kg_Bois35_to_kgGES+S17*lbs_vapeur_to_kgGES+U17*MBTU_eaurefroidie_to_kgGES+W17*MBTU_eauchaude_to_kgGES)/1000","v":0},0,489.7,{"$f":"SUM(AE9:AE16)","v":1202.1000000000001},4]
["2016-01-01",null,null,null,null,null,null,null,null,null,null,null,null,null,null,null,null,null,null,null,null,null,null,null,0,0,"","",{"$f":"(C18*kWh_Élect_to_kgGES+E18*IF(U_GNat=\"[m³]\",m3_GazNat_to_kgGES,Conversion!$H$29)+G18*IF(U_Ma2=\"[l]\",L_Mazout2_to_kgGES,Conversion!$H$31)+I18*IF(U_Ma6=\"[l]\",L_Mazout6_to_kgGES,Conversion!$H$33)+K18*L_Mazout2_to_kgGES+M18*IF(U_Prop=\"[l]\",L_Propane_to_kgGES,Conversion!$H$37)+O18*kg_Bois8_to_kgGES+Q18*kg_Bois35_to_kgGES+S18*lbs_vapeur_to_kgGES+U18*MBTU_eaurefroidie_to_kgGES+W18*MBTU_eauchaude_to_kgGES)/1000","v":0},0,723,{"$f":"SUM(AE9:AE17)","v":1691.8000000000002},3]
["2016-02-01",null,null,null,null,null,null,null,null,null,null,null,null,null,null,null,null,null,null,null,null,null,null,null,0,0,"","",{"$f":"(C19*kWh_Élect_to_kgGES+E19*IF(U_GNat=\"[m³]\",m3_GazNat_to_kgGES,Conversion!$H$29)+G19*IF(U_Ma2=\"[l]\",L_Mazout2_to_kgGES,Conversion!$H$31)+I19*IF(U_Ma6=\"[l]\",L_Mazout6_to_kgGES,Conversion!$H$33)+K19*L_Mazout2_to_kgGES+M19*IF(U_Prop=\"[l]\",L_Propane_to_kgGES,Conversion!$H$37)+O19*kg_Bois8_to_kgGES+Q19*kg_Bois35_to_kgGES+S19*lbs_vapeur_to_kgGES+U19*MBTU_eaurefroidie_to_kgGES+W19*MBTU_eauchaude_to_kgGES)/1000","v":0},0,641.79999999999995,{"$f":"SUM(AE9:AE18)","v":2414.8000000000002},2]
["2016-03-01",null,null,null,null,null,null,null,null,null,null,null,null,null,null,null,null,null,null,null,null,null,null,null,0,0,"","",{"$f":"(C20*kWh_Élect_to_kgGES+E20*IF(U_GNat=\"[m³]\",m3_GazNat_to_kgGES,Conversion!$H$29)+G20*IF(U_Ma2=\"[l]\",L_Mazout2_to_kgGES,Conversion!$H$31)+I20*IF(U_Ma6=\"[l]\",L_Mazout6_to_kgGES,Conversion!$H$33)+K20*L_Mazout2_to_kgGES+M20*IF(U_Prop=\"[l]\",L_Propane_to_kgGES,Conversion!$H$37)+O20*kg_Bois8_to_kgGES+Q20*kg_Bois35_to_kgGES+S20*lbs_vapeur_to_kgGES+U20*MBTU_eaurefroidie_to_kgGES+W20*MBTU_eauchaude_to_kgGES)/1000","v":0},0,554.79999999999995,{"$f":"SUM(AE9:AE19)","v":3056.6000000000004},1]
["TOTAL/moyenne",{"$f":"IF(ISERROR(AVERAGE(B9:B20)),0,AVERAGE(B9:B20))","v":0},{"$f":"SUM(C9:C20)","v":0},{"$f":"SUM(D9:D20)","v":0},{"$f":"SUM(E9:E20)","v":0},0,0,0,0,0,0,0,0,0,0,0,0,0,0,0,0,0,0,0,0,{"$f":"D21+F21+H21+J21+L21+N21+P21+R21+T21+V21+X21","v":0},{"$f":"IF(ISERROR(Y21/B21),\"\",Y21/B21)","v":""},{"$f":"IF(ISERROR(Z21/B21),\"\",Z21/B21)","v":""},{"$f":"(C21*kWh_Élect_to_kgGES+E21*IF(U_GNat=\"[m³]\",m3_GazNat_to_kgGES,Conversion!$H$29)+G21*IF(U_Ma2=\"[l]\",L_Mazout2_to_kgGES,Conversion!$H$31)+I21*IF(U_Ma6=\"[l]\",L_Mazout6_to_kgGES,Conversion!$H$33)+K21*L_Mazout2_to_kgGES+M21*IF(U_Prop=\"[l]\",L_Propane_to_kgGES,Conversion!$H$37)+O21*kg_Bois8_to_kgGES+Q21*kg_Bois35_to_kgGES+S21*lbs_vapeur_to_kgGES+U21*MBTU_eaurefroidie_to_kgGES+W21*MBTU_eauchaude_to_kgGES)/1000","v":0},{"$f":"(IF(ISERROR(AC21/B21),0,(AC21/B21)))*1000","v":0},{"$f":"SUM(AE9:AE20)","v":3611.4000000000005}]
[2015,"Sup_15_16","Elec_kWh_15_16","Elec_CAD_15_16","GN_m³_15_16","GN_CAD_15_16","Ma2_l_15_16","Ma2_CAD_15_16","Ma6_l_15_16","Ma6_CAD_15_16",null,null,"Prop_l_15_16","Prop_CAD_15_16","Bois20_1000kg_15_16","Bois20_CAD_15_16","Bois45_1000kg_15_16","Bois45_CAD_15_16",null,null,null,null,null,null,"GJ_Tot_15_16","CAD_Tot_15_16","GJm²_15_16","CAD/m²_15_16","GES_ton_15_16","GES_ton/m²_15_16","DJC_tot_15_16"]
["Nombre de bâtiments en propriété ou location, pour lesquels des factures d'énergie sont payées par l'organisation :"]
[]
["ATTENTION, la saisie des consommations d'énergie comporte une erreur si la cellule AA21 est ombragée d'une couleur !",null,null,null,null,null,null,null,null,null,null,null,null,null,null,null,null,null,null,null,null,null,null,null,null,null,{"$f":"Lim_bas","v":0},{"$f":"Lim_haut","v":0}]
[]
["QUESTIONS SPÉCIFIQUES (cocher si applicable)"]
[]
["1."]
["2."]
["3."]
["4."]
["5."]
[]
["AJUSTEMENTS NON PÉRIODIQUE",null,"Un ajustement correspond à une modification majeure des équipements ou du bâtiment. Il peut avoir un effet positif ou négatif sur la consommation énergétique : \n- un effet positif correspond à une augmentation majeure de la consommation, à la suite par exemple de l'ajout d'un étage de bâtiment ou de l'ajout de climatisation d'une aile d'un bâtiment;\n- un effet négatif correspond à une diminution majeure de la consommation. Cette diminution ne résulte pas forcément d’une économie provenant d’une optimisation du bâtiment.  Elle peut, par exemple, être attribuable à la fermeture d’une partie d'un bâtiment qui devient alors inoccupé.                                                                                                                                                                                                                                                 \n\nExemple :\nL'ajout de locaux implique une augmentation nette des charges de chauffage et d'éclairage de 500 kWh, telles qu’elles sont calculées par une firme d'ingénieurs. Dans ce fichier, le projet, qui sera nommé « Agrandissement », impliquera une augmentation de l'électricité de 500 kWh. Comme il s'agit de chauffage, l'ajustement y est sensible. La date d'implantation correspond au mois où l’effet sur la consommation a été effectif.\nSi l'ajustement a eu un effet sur plus qu'une source d'énergie, merci de rajouter une ligne pour chaque source touchée."]
[]
[null,"Projet","Tendance de l'impact","Source d'énergie touchée","Impact Annuel",null,"Ajustement sensible au chauffage","Date d'implantation","Impact pour l'année complète [GJ]","Impact pour l'année en cours [GJ]",null,null,null,null,null,null,null,null,null,null,null,null,null,null,null,"Énergie de l'année de référence ajustée",{"$f":"((1-Facteur_variable)+Facteur_variable*DJC_tot_15_16/DJC_tot_09_10)*GJ_Tot_09_10+GJ_Ajust_NP_Cour_15_16","v":0},"GJTotRef_Ajust_15_16"]
[null,"Nom du projet no1",null,null,null,{"$f":"IF(D38=\"électrique\",\"kWh\",IF(D38=\"Gaz naturel\",\"m³\",IF(LEFT(D38,1)=\"R\",\"1000 kg\",\"l\")))","v":"l"},null,null,{"$f":"IF(COUNTA(G38)=1,IF(C38=\"Réduction\",-1,IF(C38=\"Augmentation\",1,0))*E38*INDEX(Conversion!$A$26:$J$42,MATCH(D38,Conversion!$J$26:$J$42,0),9),0)","v":0},{"$f":"IF(G38=\"Non\",I38*L38,IF(G38=\"Oui\",I38*K38,0))","v":0},{"$f":"(DJC_tot_15_16-INDEX($A$9:$AF$20,MATCH(H38,$A$9:$A$20,0),24))/DJC_tot_15_16","v":{"$error":"#N/A"}},{"$f":"INDEX($A$9:$AG$20,MATCH(H38,$A$9:$A$20,0),25)/12","v":{"$error":"#N/A"}},null,null,null,null,null,null,null,null,null,null,null,null,null,"Énergie de l'année de suivi",{"$f":"GJ_Tot_15_16","v":0}]
[null,"Nom du projet no2",null,null,null,{"$f":"IF(D39=\"électrique\",\"kWh\",IF(D39=\"Gaz naturel\",\"m³\",IF(LEFT(D39,1)=\"R\",\"1000 kg\",\"l\")))","v":"l"},null,null,{"$f":"IF(COUNTA(G39)=1,IF(C39=\"Réduction\",-1,IF(C39=\"Augmentation\",1,0))*E39*INDEX(Conversion!$A$26:$J$42,MATCH(D39,Conversion!$J$26:$J$42,0),9),0)","v":0},0,{"$error":"#N/A"},{"$error":"#N/A"},null,null,null,null,null,null,null,null,null,null,null,null,null,"Superficie de l'année de référence",{"$f":"Sup_09_10","v":0}]
[null,"Nom du projet no3",null,null,null,"l",null,null,{"$f":"IF(COUNTA(G40)=1,IF(C40=\"Réduction\",-1,IF(C40=\"Augmentation\",1,0))*E40*INDEX(Conversion!$A$26:$J$42,MATCH(D40,Conversion!$J$26:$J$42,0),9),0)","v":0},0,{"$error":"#N/A"},{"$error":"#N/A"},null,null,null,null,null,null,null,null,null,null,null,null,null,"Superficie de l'année de suivi",{"$f":"Sup_15_16","v":0}]
[null,"Nom du projet no4",null,null,null,"l",null,null,{"$f":"IF(COUNTA(G41)=1,IF(C41=\"Réduction\",-1,IF(C41=\"Augmentation\",1,0))*E41*INDEX(Conversion!$A$26:$J$42,MATCH(D41,Conversion!$J$26:$J$42,0),9),0)","v":0},0,{"$error":"#N/A"},{"$error":"#N/A"},null,null,null,null,null,null,null,null,null,null,null,null,null,null,{"$f":"GJTotRef_Ajust_15_16/Sup_09_10","v":{"$error":"#DIV/0!"}},"GJTotRef_Ajust_m²_15_16"]
[null,"Nom du projet no5",null,null,null,"l",null,null,{"$f":"IF(COUNTA(G42)=1,IF(C42=\"Réduction\",-1,IF(C42=\"Augmentation\",1,0))*E42*INDEX(Conversion!$A$26:$J$42,MATCH(D42,Conversion!$J$26:$J$42,0),9),0)","v":0},0,{"$error":"#N/A"},{"$error":"#N/A"},null,null,null,null,null,null,null,null,null,null,null,null,null,null,{"$f":"J45","v":0},"GJ_Ajust_NP_Cour_15_16"]
[null,"Nom du projet no6",null,null,null,"l",null,null,{"$f":"IF(COUNTA(G43)=1,IF(C43=\"Réduction\",-1,IF(C43=\"Augmentation\",1,0))*E43*INDEX(Conversion!$A$26:$J$42,MATCH(D43,Conversion!$J$26:$J$42,0),9),0)","v":0},0,{"$error":"#N/A"},{"$error":"#N/A"},null,null,null,null,null,null,null,null,null,null,null,null,null,null,{"$f":"I45","v":0},"GJ_Ajust_NP_annuel_15_16"]
[null,"Nom du projet no7",null,null,null,"l",null,null,{"$f":"IF(COUNTA(G44)=1,IF(C44=\"Réduction\",-1,IF(C44=\"Augmentation\",1,0))*E44*INDEX(Conversion!$A$26:$J$42,MATCH(D44,Conversion!$J$26:$J$42,0),9),0)","v":0},0,{"$error":"#N/A"},{"$error":"#N/A"}]
[null,"TOTAL",null,null,null,null,null,null,{"$f":"SUM(I38:I44)","v":0},{"$f":"SUM(J38:J44)","v":0}]
[]
[]
[]
[]
[]
[]
[]
[]
[null,null,"Réduction","Électrique",null,null,"Oui"]
[null,null,"Augmentation","Gaz naturel",null,null,"Non"]
[null,null,null,"Mazout n°2"]
[null,null,null,"Mazout n°6"]
[null,null,null,"Propane"]
[null,null,null,"Résidus de bois (20%humidité)"]
[null,null,null,"Résidus de bois (45%humidité)"]
[null,null,null,"-"]

{"sheet":"2016-2017","index":9,"n_rows":61,"n_cols":33,"rows_kept":61,"cut":false,"hidden":false,"merged":[[34,0,34,1],[34,2,34,13],[6,0,7,0],[6,2,6,3],[6,4,6,5],[6,10,6,11],[24,0,24,8],[6,6,6,7],[6,8,6,9],[6,12,6,13],[6,18,6,19],[6,20,6,21],[6,26,6,27],[6,28,6,29],[6,14,6,15],[6,22,6,23],[6,16,6,17],[6,24,6,25]]}
[null,null,"Système de suivi de la consommation énergétique dans les bâtiments"]
[null,null,null,"Saisir les données énergétiques et les données sur les dépenses annuelles, avant taxes, dans les cellules ombragées en bleu pâle."]
[null,null,null,"Pour les fins du MERN, la saisie mensuelle des données est optionnelle. Les espaces pour saisir mensuellement les données sont mises à la disposition des MO afin de leur permettre de suivre périodiquement la consommation."]
[null,null,null,"Dans le cas où un projet ayant un effet sur la consommation énergétique a eu lieu au cours de l'année (rénovation, agrandissement, etc.), "]
[null,null,null,"veuillez remplir la section « AJUSTEMENTS NON PÉRIODIQUES », ci-dessous."]
[]
["<-- Résumé","Superficie","Consommation électrique",null,"Gaz naturel",null,"Mazout n°2 ",null,"Mazout n°6",null,"Diesel (génératrice)",null,"Propane",null,"Résidus de bois\n (8% d'humidité)",null,"Résidus de bois\n(35% d'humidité)",null,"Vapeur",null,"Eau refroidie",null,"Eau chaude",null,"TOTAL",null,"Intensité Énergétique",null,"GES",null,"DJC"]
[null,"[m²]","[kWh]","[$]","[m³]","[$]","[l]","[$]","[l]","[$]","[l]","[$]","[l]","[$]","[1000 kg MG]","[$]","[1000 kg MG]","[$]","[lbs]","[$]","[MBTU]","[$]","[MBTU]","[$]"," [GJ]","[$]","[GJ/m²]","[$/m²]","[t CO2 éq.]","[kg CO2 éq./m²]"," [° C]"]
[{"$f":"VALUE(CONCATENATE(LEFT(Annee_financiere,FIND(\"-\",Annee_financiere)-1),\"-\",A22))","v":"2016-04-01"},null,null,null,null,null,null,null,null,null,null,null,null,null,null,null,null,null,null,null,null,null,null,null,{"$f":"C9*kWh_Élect_to_GJ+E9*m3_GazNat_to_GJ+G9*L_Mazout2_to_GJ+I9*L_Mazout6_to_GJ+K9*L_Mazout2_to_GJ+M9*L_Propane_to_GJ+O9*kg_Bois8_to_GJ+Q9*kg_Bois35_to_GJ+S9*lbs_vapeur_to_GJ+U9*MBTU_eaurefroidie_to_GJ+W9*MBTU_eauchaude_to_GJ","v":0},{"$f":"D9+F9+H9+J9+N9+P9+R9+T9+V9+X9+L9","v":0},{"$f":"IF(ISERROR(Y9/B9),\"\",Y9/B9)","v":""},{"$f":"IF(ISERROR(Z9/B9),\"\",Z9/B9)","v":""},{"$f":"(C9*kWh_Élect_to_kgGES+E9*IF(U_GNat=\"[m³]\",m3_GazNat_to_kgGES,Conversion!$H$29)+G9*IF(U_Ma2=\"[l]\",L_Mazout2_to_kgGES,Conversion!$H$31)+I9*IF(U_Ma6=\"[l]\",L_Mazout6_to_kgGES,Conversion!$H$33)+K9*L_Mazout2_to_kgGES+M9*IF(U_Prop=\"[l]\",L_Propane_to_kgGES,Conversion!$H$37)+O9*kg_Bois8_to_kgGES+Q9*kg_Bois35_to_kgGES+S9*lbs_vapeur_to_kgGES+U9*MBTU_eaurefroidie_to_kgGES+W9*MBTU_eauchaude_to_kgGES)/1000","v":0},{"$f":"(IF(ISERROR(AC9/B9),0,(AC9/B9)))*1000","v":0},{"$f":"INDEX(plage_DJ,MATCH(A9,plage_date),3)","v":417.7},null,12]
[{"$f":"DATE(YEAR(A9),MONTH(A9)+1,DAY(A9))","v":"2016-05-01"},null,null,null,null,null,null,null,null,null,null,null,null,null,null,null,null,null,null,null,null,null,null,null,{"$f":"C10*kWh_Élect_to_GJ+E10*m3_GazNat_to_GJ+G10*L_Mazout2_to_GJ+I10*L_Mazout6_to_GJ+K10*L_Mazout2_to_GJ+M10*L_Propane_to_GJ+O10*kg_Bois8_to_GJ+Q10*kg_Bois35_to_GJ+S10*lbs_vapeur_to_GJ+U10*MBTU_eaurefroidie_to_GJ+W10*MBTU_eauchaude_to_GJ","v":0},{"$f":"D10+F10+H10+J10+N10+P10+R10+T10+V10+X10+L10","v":0},{"$f":"IF(ISERROR(Y10/B10),\"\",Y10/B10)","v":""},{"$f":"IF(ISERROR(Z10/B10),\"\",Z10/B10)","v":""},{"$f":"(C10*kWh_Élect_to_kgGES+E10*IF(U_GNat=\"[m³]\",m3_GazNat_to_kgGES,Conversion!$H$29)+G10*IF(U_Ma2=\"[l]\",L_Mazout2_to_kgGES,Conversion!$H$31)+I10*IF(U_Ma6=\"[l]\",L_Mazout6_to_kgGES,Conversion!$H$33)+K10*L_Mazout2_to_kgGES+M10*IF(U_Prop=\"[l]\",L_Propane_to_kgGES,Conversion!$H$37)+O10*kg_Bois8_to_kgGES+Q10*kg_Bois35_to_kgGES+S10*lbs_vapeur_to_kgGES+U10*MBTU_eaurefroidie_to_kgGES+W10*MBTU_eauchaude_to_kgGES)/1000","v":0},{"$f":"(IF(ISERROR(AC10/B10),0,(AC10/B10)))*1000","v":0},132.19999999999999,{"$f":"SUM(AE9)","v":417.7},11]
[{"$f":"DATE(YEAR(A10),MONTH(A10)+1,DAY(A10))","v":"2016-06-01"},null,null,null,null,null,null,null,null,null,null,null,null,null,null,null,null,null,null,null,null,null,null,null,0,0,"","",{"$f":"(C11*kWh_Élect_to_kgGES+E11*IF(U_GNat=\"[m³]\",m3_GazNat_to_kgGES,Conversion!$H$29)+G11*IF(U_Ma2=\"[l]\",L_Mazout2_to_kgGES,Conversion!$H$31)+I11*IF(U_Ma6=\"[l]\",L_Mazout6_to_kgGES,Conversion!$H$33)+K11*L_Mazout2_to_kgGES+M11*IF(U_Prop=\"[l]\",L_Propane_to_kgGES,Conversion!$H$37)+O11*kg_Bois8_to_kgGES+Q11*kg_Bois35_to_kgGES+S11*lbs_vapeur_to_kgGES+U11*MBTU_eaurefroidie_to_kgGES+W11*MBTU_eauchaude_to_kgGES)/1000","v":0},0,31.2,{"$f":"SUM(AE9:AE10)","v":549.9},10]
["2016-07-01",null,null,null,null,null,null,null,null,null,null,null,null,null,null,null,null,null,null,null,null,null,null,null,0,0,"","",{"$f":"(C12*kWh_Élect_to_kgGES+E12*IF(U_GNat=\"[m³]\",m3_GazNat_to_kgGES,Conversion!$H$29)+G12*IF(U_Ma2=\"[l]\",L_Mazout2_to_kgGES,Conversion!$H$31)+I12*IF(U_Ma6=\"[l]\",L_Mazout6_to_kgGES,Conversion!$H$33)+K12*L_Mazout2_to_kgGES+M12*IF(U_Prop=\"[l]\",L_Propane_to_kgGES,Conversion!$H$37)+O12*kg_Bois8_to_kgGES+Q12*kg_Bois35_to_kgGES+S12*lbs_vapeur_to_kgGES+U12*MBTU_eaurefroidie_to_kgGES+W12*MBTU_eauchaude_to_kgGES)/1000","v":0},0,3.4,{"$f":"SUM(AE9:AE11)","v":581.1},9]
["2016-08-01",null,null,null,null,null,null,null,null,null,null,null,null,null,null,null,null,null,null,null,null,null,null,null,0,0,"","",{"$f":"(C13*kWh_Élect_to_kgGES+E13*IF(U_GNat=\"[m³]\",m3_GazNat_to_kgGES,Conversion!$H$29)+G13*IF(U_Ma2=\"[l]\",L_Mazout2_to_kgGES,Conversion!$H$31)+I13*IF(U_Ma6=\"[l]\",L_Mazout6_to_kgGES,Conversion!$H$33)+K13*L_Mazout2_to_kgGES+M13*IF(U_Prop=\"[l]\",L_Propane_to_kgGES,Conversion!$H$37)+O13*kg_Bois8_to_kgGES+Q13*kg_Bois35_to_kgGES+S13*lbs_vapeur_to_kgGES+U13*MBTU_eaurefroidie_to_kgGES+W13*MBTU_eauchaude_to_kgGES)/1000","v":0},0,0.6,{"$f":"SUM(AE9:AE12)","v":584.5},8]
["2016-09-01",null,null,null,null,null,null,null,null,null,null,null,null,null,null,null,null,null,null,null,null,null,null,null,0,0,"","",{"$f":"(C14*kWh_Élect_to_kgGES+E14*IF(U_GNat=\"[m³]\",m3_GazNat_to_kgGES,Conversion!$H$29)+G14*IF(U_Ma2=\"[l]\",L_Mazout2_to_kgGES,Conversion!$H$31)+I14*IF(U_Ma6=\"[l]\",L_Mazout6_to_kgGES,Conversion!$H$33)+K14*L_Mazout2_to_kgGES+M14*IF(U_Prop=\"[l]\",L_Propane_to_kgGES,Conversion!$H$37)+O14*kg_Bois8_to_kgGES+Q14*kg_Bois35_to_kgGES+S14*lbs_vapeur_to_kgGES+U14*MBTU_eaurefroidie_to_kgGES+W14*MBTU_eauchaude_to_kgGES)/1000","v":0},0,48,{"$f":"SUM(AE9:AE13)","v":585.1},7]
["2016-10-01",null,null,null,null,null,null,null,null,null,null,null,null,null,null,null,null,null,null,null,null,null,null,null,0,0,"","",{"$f":"(C15*kWh_Élect_to_kgGES+E15*IF(U_GNat=\"[m³]\",m3_GazNat_to_kgGES,Conversion!$H$29)+G15*IF(U_Ma2=\"[l]\",L_Mazout2_to_kgGES,Conversion!$H$31)+I15*IF(U_Ma6=\"[l]\",L_Mazout6_to_kgGES,Conversion!$H$33)+K15*L_Mazout2_to_kgGES+M15*IF(U_Prop=\"[l]\",L_Propane_to_kgGES,Conversion!$H$37)+O15*kg_Bois8_to_kgGES+Q15*kg_Bois35_to_kgGES+S15*lbs_vapeur_to_kgGES+U15*MBTU_eaurefroidie_to_kgGES+W15*MBTU_eauchaude_to_kgGES)/1000","v":0},0,254.1,{"$f":"SUM(AE9:AE14)","v":633.1},6]
["2016-11-01",null,null,null,null,null,null,null,null,null,null,null,null,null,null,null,null,null,null,null,null,null,null,null,0,0,"","",{"$f":"(C16*kWh_Élect_to_kgGES+E16*IF(U_GNat=\"[m³]\",m3_GazNat_to_kgGES,Conversion!$H$29)+G16*IF(U_Ma2=\"[l]\",L_Mazout2_to_kgGES,Conversion!$H$31)+I16*IF(U_Ma6=\"[l]\",L_Mazout6_to_kgGES,Conversion!$H$33)+K16*L_Mazout2_to_kgGES+M16*IF(U_Prop=\"[l]\",L_Propane_to_kgGES,Conversion!$H$37)+O16*kg_Bois8_to_kgGES+Q16*kg_Bois35_to_kgGES+S16*lbs_vapeur_to_kgGES+U16*MBTU_eaurefroidie_to_kgGES+W16*MBTU_eauchaude_to_kgGES)/1000","v":0},0,406.9,{"$f":"SUM(AE9:AE15)","v":887.2},5]
["2016-12-01",null,null,null,null,null,null,null,null,null,null,null,null,null,null,null,null,null,null,null,null,null,null,null,0,0,"","",{"$f":"(C17*kWh_Élect_to_kgGES+E17*IF(U_GNat=\"[m³]\",m3_GazNat_to_kgGES,Conversion!$H$29)+G17*IF(U_Ma2=\"[l]\",L_Mazout2_to_kgGES,Conversion!$H$31)+I17*IF(U_Ma6=\"[l]\",L_Mazout6_to_kgGES,Conversion!$H$33)+K17*L_Mazout2_to_kgGES+M17*IF(U_Prop=\"[l]\",L_Propane_to_kgGES,Conversion!$H$37)+O17*kg_Bois8_to_kgGES+Q17*kg_Bois35_to_kgGES+S17*lbs_vapeur_to_kgGES+U17*MBTU_eaurefroidie_to_kgGES+W17*MBTU_eauchaude_to_kgGES)/1000","v":0},0,690.4,{"$f":"SUM(AE9:AE16)","v":1294.0999999999999},4]
["2017-01-01",null,null,null,null,null,null,null,null,null,null,null,null,null,null,null,null,null,null,null,null,null,null,null,0,0,"","",{"$f":"(C18*kWh_Élect_to_kgGES+E18*IF(U_GNat=\"[m³]\",m3_GazNat_to_kgGES,Conversion!$H$29)+G18*IF(U_Ma2=\"[l]\",L_Mazout2_to_kgGES,Conversion!$H$31)+I18*IF(U_Ma6=\"[l]\",L_Mazout6_to_kgGES,Conversion!$H$33)+K18*L_Mazout2_to_kgGES+M18*IF(U_Prop=\"[l]\",L_Propane_to_kgGES,Conversion!$H$37)+O18*kg_Bois8_to_kgGES+Q18*kg_Bois35_to_kgGES+S18*lbs_vapeur_to_kgGES+U18*MBTU_eaurefroidie_to_kgGES+W18*MBTU_eauchaude_to_kgGES)/1000","v":0},0,699,{"$f":"SUM(AE9:AE17)","v":1984.5},3]
["2017-02-01",null,null,null,null,null,null,null,null,null,null,null,null,null,null,null,null,null,null,null,null,null,null,null,0,0,"","",{"$f":"(C19*kWh_Élect_to_kgGES+E19*IF(U_GNat=\"[m³]\",m3_GazNat_to_kgGES,Conversion!$H$29)+G19*IF(U_Ma2=\"[l]\",L_Mazout2_to_kgGES,Conversion!$H$31)+I19*IF(U_Ma6=\"[l]\",L_Mazout6_to_kgGES,Conversion!$H$33)+K19*L_Mazout2_to_kgGES+M19*IF(U_Prop=\"[l]\",L_Propane_to_kgGES,Conversion!$H$37)+O19*kg_Bois8_to_kgGES+Q19*kg_Bois35_to_kgGES+S19*lbs_vapeur_to_kgGES+U19*MBTU_eaurefroidie_to_kgGES+W19*MBTU_eauchaude_to_kgGES)/1000","v":0},0,607.5,{"$f":"SUM(AE9:AE18)","v":2683.5},2]
["2017-03-01",null,null,null,null,null,null,null,null,null,null,null,null,null,null,null,null,null,null,null,null,null,null,null,0,0,"","",{"$f":"(C20*kWh_Élect_to_kgGES+E20*IF(U_GNat=\"[m³]\",m3_GazNat_to_kgGES,Conversion!$H$29)+G20*IF(U_Ma2=\"[l]\",L_Mazout2_to_kgGES,Conversion!$H$31)+I20*IF(U_Ma6=\"[l]\",L_Mazout6_to_kgGES,Conversion!$H$33)+K20*L_Mazout2_to_kgGES+M20*IF(U_Prop=\"[l]\",L_Propane_to_kgGES,Conversion!$H$37)+O20*kg_Bois8_to_kgGES+Q20*kg_Bois35_to_kgGES+S20*lbs_vapeur_to_kgGES+U20*MBTU_eaurefroidie_to_kgGES+W20*MBTU_eauchaude_to_kgGES)/1000","v":0},0,660.9,{"$f":"SUM(AE9:AE19)","v":3291},1]
["TOTAL/moyenne",{"$f":"IF(ISERROR(AVERAGE(B9:B20)),0,AVERAGE(B9:B20))","v":0},{"$f":"SUM(C9:C20)","v":0},{"$f":"SUM(D9:D20)","v":0},{"$f":"SUM(E9:E20)","v":0},0,0,0,0,0,0,0,0,0,0,0,0,0,0,0,0,0,0,0,{"$f":"C21*kWh_Élect_to_GJ+E21*m3_GazNat_to_GJ+G21*L_Mazout2_to_GJ+I21*L_Mazout6_to_GJ+K21*L_Mazout2_to_GJ+M21*L_Propane_to_GJ+O21*kg_Bois8_to_GJ+Q21*kg_Bois35_to_GJ+S21*lbs_vapeur_to_GJ+U21*MBTU_eaurefroidie_to_GJ+W21*MBTU_eauchaude_to_GJ","v":0},{"$f":"D21+F21+H21+J21+L21+N21+P21+R21+T21+V21+X21","v":0},{"$f":"IF(ISERROR(Y21/B21),\"\",Y21/B21)","v":""},{"$f":"IF(ISERROR(Z21/B21),\"\",Z21/B21)","v":""},{"$f":"(C21*kWh_Élect_to_kgGES+E21*IF(U_GNat=\"[m³]\",m3_GazNat_to_kgGES,Conversion!$H$29)+G21*IF(U_Ma2=\"[l]\",L_Mazout2_to_kgGES,Conversion!$H$31)+I21*IF(U_Ma6=\"[l]\",L_Mazout6_to_kgGES,Conversion!$H$33)+K21*L_Mazout2_to_kgGES+M21*IF(U_Prop=\"[l]\",L_Propane_to_kgGES,Conversion!$H$37)+O21*kg_Bois8_to_kgGES+Q21*kg_Bois35_to_kgGES+S21*lbs_vapeur_to_kgGES+U21*MBTU_eaurefroidie_to_kgGES+W21*MBTU_eauchaude_to_kgGES)/1000","v":0},{"$f":"(IF(ISERROR(AC21/B21),0,(AC21/B21)))*1000","v":0},{"$f":"SUM(AE9:AE20)","v":3951.9}]
[2016,"Sup_16_17","Elec_kWh_16_17","Elec_CAD_16_17","GN_m³_16_17","GN_CAD_16_17","Ma2_l_16_17","Ma2_CAD_16_17","Ma6_l_16_17","Ma6_CAD_16_17",null,null,"Prop_l_16_17","Prop_CAD_16_17","Bois20_1000kg_16_17","Bois20_CAD_16_17","Bois45_1000kg_16_17","Bois45_CAD_16_17",null,null,null,null,null,null,"GJ_Tot_16_17","CAD_Tot_16_17","GJm²_16_17","CAD/m²_16_17","GES_ton_16_17","GES_ton/m²_16_17","DJC_tot_16_17"]
["Nombre de bâtiments en propriété ou location, pour lesquels des factures d'énergie sont payées par l'organisation :"]
[]
["ATTENTION, la saisie des consommations d'énergie comporte une erreur si la cellule AA21 est ombragée d'une couleur !",null,null,null,null,null,null,null,null,null,null,null,null,null,null,null,null,null,null,null,null,null,null,null,null,null,{"$f":"Lim_bas","v":0},{"$f":"Lim_haut","v":0}]
[]
["QUESTIONS SPÉCIFIQUES (cocher si applicable)"]
[]
["1."]
["2."]
["3."]
["4."]
["5."]
[]
["AJUSTEMENTS NON PÉRIODIQUE",null,"Un ajustement correspond à une modification majeure des équipements ou du bâtiment. Il peut avoir un effet positif ou négatif sur la consommation énergétique : \n- un effet positif correspond à une augmentation majeure de la consommation, à la suite par exemple de l'ajout d'un étage de bâtiment ou de l'ajout de climatisation d'une aile d'un bâtiment;\n- un effet négatif correspond à une diminution majeure de la consommation. Cette diminution ne résulte pas forcément d’une économie provenant d’une optimisation du bâtiment.  Elle peut, par exemple, être attribuable à la fermeture d’une partie d'un bâtiment qui devient alors inoccupé.                                                                                                                                                                                                                                                 \n\nExemple :\nL'ajout de locaux implique une augmentation nette des charges de chauffage et d'éclairage de 500 kWh, telles qu’elles sont calculées par une firme d'ingénieurs. Dans ce fichier, le projet, qui sera nommé « Agrandissement », impliquera une augmentation de l'électricité de 500 kWh. Comme il s'agit de chauffage, l'ajustement y est sensible. La date d'implantation correspond au mois où l’effet sur la consommation a été effectif.\nSi l'ajustement a eu un effet sur plus qu'une source d'énergie, merci de rajouter une ligne pour chaque source touchée."]
[]
[null,"Projet","Tendance de l'impact","Source d'énergie touchée","Impact Annuel",null,"Ajustement sensible au chauffage","Date d'implantation","Impact pour l'année complète [GJ]","Impact pour l'année en cours [GJ]",null,null,null,null,null,null,null,null,null,null,null,null,null,null,null,"Énergie de l'année de référence ajustée",{"$f":"((1-Facteur_variable)+Facteur_variable*DJC_tot_16_17/DJC_tot_09_10)*GJ_Tot_09_10+GJ_Ajust_NP_Cour_16_17","v":0},"GJTotRef_Ajust_16_17"]
[null,"Nom du projet no1",null,null,null,{"$f":"IF(D38=\"électrique\",\"kWh\",IF(D38=\"Gaz naturel\",\"m³\",IF(LEFT(D38,1)=\"R\",\"1000 kg\",\"l\")))","v":"l"},null,null,{"$f":"IF(COUNTA(G38)=1,IF(C38=\"Réduction\",-1,IF(C38=\"Augmentation\",1,0))*E38*INDEX(Conversion!$A$26:$J$42,MATCH(D38,Conversion!$J$26:$J$42,0),9),0)","v":0},{"$f":"IF(G38=\"Non\",I38*L38,IF(G38=\"Oui\",I38*K38,0))","v":0},{"$f":"(DJC_tot_16_17-INDEX($A$9:$AF$20,MATCH(H38,$A$9:$A$20,0),24))/DJC_tot_16_17","v":{"$error":"#N/A"}},{"$f":"INDEX($A$9:$AG$20,MATCH(H38,$A$9:$A$20,0),25)/12","v":{"$error":"#N/A"}},null,null,null,null,null,null,null,null,null,null,null,null,null,"Énergie de l'année de suivi",{"$f":"GJ_Tot_16_17","v":0}]
[null,"Nom du projet no2",null,null,null,{"$f":"IF(D39=\"électrique\",\"kWh\",IF(D39=\"Gaz naturel\",\"m³\",IF(LEFT(D39,1)=\"R\",\"1000 kg\",\"l\")))","v":"l"},null,null,{"$f":"IF(COUNTA(G39)=1,IF(C39=\"Réduction\",-1,IF(C39=\"Augmentation\",1,0))*E39*INDEX(Conversion!$A$26:$J$42,MATCH(D39,Conversion!$J$26:$J$42,0),9),0)","v":0},0,{"$error":"#N/A"},{"$error":"#N/A"},null,null,null,null,null,null,null,null,null,null,null,null,null,"Superficie de l'année de référence",{"$f":"Sup_09_10","v":0}]
[null,"Nom du projet no3",null,null,null,"l",null,null,{"$f":"IF(COUNTA(G40)=1,IF(C40=\"Réduction\",-1,IF(C40=\"Augmentation\",1,0))*E40*INDEX(Conversion!$A$26:$J$42,MATCH(D40,Conversion!$J$26:$J$42,0),9),0)","v":0},0,{"$error":"#N/A"},{"$error":"#N/A"},null,null,null,null,null,null,null,null,null,null,null,null,null,"Superficie de l'année de suivi",{"$f":"Sup_16_17","v":0}]
[null,"Nom du projet no4",null,null,null,"l",null,null,{"$f":"IF(COUNTA(G41)=1,IF(C41=\"Réduction\",-1,IF(C41=\"Augmentation\",1,0))*E41*INDEX(Conversion!$A$26:$J$42,MATCH(D41,Conversion!$J$26:$J$42,0),9),0)","v":0},0,{"$error":"#N/A"},{"$error":"#N/A"},null,null,null,null,null,null,null,null,null,null,null,null,null,null,{"$f":"GJTotRef_Ajust_16_17/Sup_09_10","v":{"$error":"#DIV/0!"}},"GJTotRef_Ajust_m²_16_17"]
[null,"Nom du projet no5",null,null,null,"l",null,null,{"$f":"IF(COUNTA(G42)=1,IF(C42=\"Réduction\",-1,IF(C42=\"Augmentation\",1,0))*E42*INDEX(Conversion!$A$26:$J$42,MATCH(D42,Conversion!$J$26:$J$42,0),9),0)","v":0},0,{"$error":"#N/A"},{"$error":"#N/A"},null,null,null,null,null,null,null,null,null,null,null,null,null,null,{"$f":"J45","v":0},"GJ_Ajust_NP_Cour_16_17"]
[null,"Nom du projet no6",null,null,null,"l",null,null,{"$f":"IF(COUNTA(G43)=1,IF(C43=\"Réduction\",-1,IF(C43=\"Augmentation\",1,0))*E43*INDEX(Conversion!$A$26:$J$42,MATCH(D43,Conversion!$J$26:$J$42,0),9),0)","v":0},0,{"$error":"#N/A"},{"$error":"#N/A"},null,null,null,null,null,null,null,null,null,null,null,null,null,null,{"$f":"I45","v":0},"GJ_Ajust_NP_annuel_16_17"]
[null,"Nom du projet no7",null,null,null,"l",null,null,{"$f":"IF(COUNTA(G44)=1,IF(C44=\"Réduction\",-1,IF(C44=\"Augmentation\",1,0))*E44*INDEX(Conversion!$A$26:$J$42,MATCH(D44,Conversion!$J$26:$J$42,0),9),0)","v":0},0,{"$error":"#N/A"},{"$error":"#N/A"}]
[null,"TOTAL",null,null,null,null,null,null,{"$f":"SUM(I38:I44)","v":0},{"$f":"SUM(J38:J44)","v":0}]
[]
[]
[]
[]
[]
[]
[]
[]
[null,null,"Réduction","Électrique",null,null,"Oui"]
[null,null,"Augmentation","Gaz naturel",null,null,"Non"]
[null,null,null,"Mazout n°2"]
[null,null,null,"Mazout n°6"]
[null,null,null,"Propane"]
[null,null,null,"Résidus de bois (20%humidité)"]
[null,null,null,"Résidus de bois (45%humidité)"]
[null,null,null,"-"]

{"sheet":"2017-2018","index":10,"n_rows":61,"n_cols":33,"rows_kept":61,"cut":false,"hidden":false,"merged":[[6,12,6,13],[34,0,34,1],[34,2,34,11],[6,0,7,0],[6,2,6,3],[6,4,6,5],[6,10,6,11],[24,0,24,8],[6,6,6,7],[6,8,6,9],[6,18,6,19],[6,20,6,21],[6,26,6,27],[6,28,6,29],[6,14,6,15],[6,22,6,23],[6,16,6,17],[6,24,6,25]]}
[]
[null,null,null,"Saisir les données énergétiques et les données sur les dépenses annuelles, avant taxes, dans les cellules ombragées en bleu pâle."]
[null,null,null,"Pour les fins du MERN, la saisie mensuelle des données est optionnelle. Les espaces pour saisir mensuellement les données sont mises à la disposition des MO afin de leur permettre de suivre périodiquement la consommation."]
[null,null,null,"Dans le cas où un projet ayant un effet sur la consommation énergétique a eu lieu au cours de l'année (rénovation, agrandissement, etc.), "]
[null,null,null,"veuillez remplir la section « AJUSTEMENTS NON PÉRIODIQUES », ci-dessous."]
[]
["<-- Résumé","Superficie","Consommation électrique",null,"Gaz naturel",null,"Mazout n°2 ",null,"Mazout n°6",null,"Diesel (génératrice)",null,"Propane",null,"Résidus de bois\n (20% d'humidité)",null,"Résidus de bois\n(45% d'humidité)",null,"Vapeur",null,"Eau refroidie",null,"Eau chaude",null,"TOTAL",null,"Intensité Énergétique",null,"GES",null,"DJC"]
[null,"[m²]","[kWh]","[$]","[m³]","[$]","[l]","[$]","[l]","[$]","[l]","[$]","[l]","[$]","[1000 kg MG]","[$]","[1000 kg MG]","[$]","[lbs]","[$]","[MBTU]","[$]","[MBTU]","[$]"," [GJ]","[$]","[GJ/m²]","[$/m²]","[Ton CO2 eq]","[kg CO2 eq/m²]"," [° C]"]
[{"$f":"VALUE(CONCATENATE(LEFT(Annee_financiere,FIND(\"-\",Annee_financiere)-1),\"-\",A22))","v":"2017-04-01"},null,null,null,null,null,null,null,null,null,null,null,null,null,null,null,null,null,null,null,null,null,null,null,{"$f":"C9*kWh_Élect_to_GJ+E9*m3_GazNat_to_GJ+G9*L_Mazout2_to_GJ+I9*L_Mazout6_to_GJ+K9*L_Mazout2_to_GJ+M9*L_Propane_to_GJ+O9*kg_Bois8_to_GJ+Q9*kg_Bois35_to_GJ+S9*lbs_vapeur_to_GJ+U9*MBTU_eaurefroidie_to_GJ+W9*MBTU_eauchaude_to_GJ","v":0},{"$f":"D9+F9+H9+J9+N9+P9+R9+T9+V9+X9+L9","v":0},{"$f":"IF(ISERROR(Y9/B9),\"\",Y9/B9)","v":""},{"$f":"IF(ISERROR(Z9/B9),\"\",Z9/B9)","v":""},{"$f":"(C9*kWh_Élect_to_kgGES+E9*IF(U_GNat=\"[m³]\",m3_GazNat_to_kgGES,Conversion!$H$29)+G9*IF(U_Ma2=\"[l]\",L_Mazout2_to_kgGES,Conversion!$H$31)+I9*IF(U_Ma6=\"[l]\",L_Mazout6_to_kgGES,Conversion!$H$33)+K9*L_Mazout2_to_kgGES+M9*IF(U_Prop=\"[l]\",L_Propane_to_kgGES,Conversion!$H$37)+O9*kg_Bois8_to_kgGES+Q9*kg_Bois35_to_kgGES+S9*lbs_vapeur_to_kgGES+U9*MBTU_eaurefroidie_to_kgGES+W9*MBTU_eauchaude_to_kgGES)/1000","v":0},{"$f":"(IF(ISERROR(AC9/B9),0,(AC9/B9)))*1000","v":0},{"$f":"INDEX(plage_DJ,MATCH(A9,plage_date),3)","v":300.7},null,12]
[{"$f":"DATE(YEAR(A9),MONTH(A9)+1,DAY(A9))","v":"2017-05-01"},null,null,null,null,null,null,null,null,null,null,null,null,null,null,null,null,null,null,null,null,null,null,null,{"$f":"C10*kWh_Élect_to_GJ+E10*m3_GazNat_to_GJ+G10*L_Mazout2_to_GJ+I10*L_Mazout6_to_GJ+K10*L_Mazout2_to_GJ+M10*L_Propane_to_GJ+O10*kg_Bois8_to_GJ+Q10*kg_Bois35_to_GJ+S10*lbs_vapeur_to_GJ+U10*MBTU_eaurefroidie_to_GJ+W10*MBTU_eauchaude_to_GJ","v":0},{"$f":"D10+F10+H10+J10+N10+P10+R10+T10+V10+X10+L10","v":0},"","",{"$f":"(C10*kWh_Élect_to_kgGES+E10*IF(U_GNat=\"[m³]\",m3_GazNat_to_kgGES,Conversion!$H$29)+G10*IF(U_Ma2=\"[l]\",L_Mazout2_to_kgGES,Conversion!$H$31)+I10*IF(U_Ma6=\"[l]\",L_Mazout6_to_kgGES,Conversion!$H$33)+K10*L_Mazout2_to_kgGES+M10*IF(U_Prop=\"[l]\",L_Propane_to_kgGES,Conversion!$H$37)+O10*kg_Bois8_to_kgGES+Q10*kg_Bois35_to_kgGES+S10*lbs_vapeur_to_kgGES+U10*MBTU_eaurefroidie_to_kgGES+W10*MBTU_eauchaude_to_kgGES)/1000","v":0},0,157.30000000000001,{"$f":"SUM(AE9)","v":300.7},11]
[{"$f":"DATE(YEAR(A10),MONTH(A10)+1,DAY(A10))","v":"2017-06-01"},null,null,null,null,null,null,null,null,null,null,null,null,null,null,null,null,null,null,null,null,null,null,null,0,0,"","",{"$f":"(C11*kWh_Élect_to_kgGES+E11*IF(U_GNat=\"[m³]\",m3_GazNat_to_kgGES,Conversion!$H$29)+G11*IF(U_Ma2=\"[l]\",L_Mazout2_to_kgGES,Conversion!$H$31)+I11*IF(U_Ma6=\"[l]\",L_Mazout6_to_kgGES,Conversion!$H$33)+K11*L_Mazout2_to_kgGES+M11*IF(U_Prop=\"[l]\",L_Propane_to_kgGES,Conversion!$H$37)+O11*kg_Bois8_to_kgGES+Q11*kg_Bois35_to_kgGES+S11*lbs_vapeur_to_kgGES+U11*MBTU_eaurefroidie_to_kgGES+W11*MBTU_eauchaude_to_kgGES)/1000","v":0},0,30.2,{"$f":"SUM(AE9:AE10)","v":458},10]
["2017-07-01",null,null,null,null,null,null,null,null,null,null,null,null,null,null,null,null,null,null,null,null,null,null,null,0,0,"","",{"$f":"(C12*kWh_Élect_to_kgGES+E12*IF(U_GNat=\"[m³]\",m3_GazNat_to_kgGES,Conversion!$H$29)+G12*IF(U_Ma2=\"[l]\",L_Mazout2_to_kgGES,Conversion!$H$31)+I12*IF(U_Ma6=\"[l]\",L_Mazout6_to_kgGES,Conversion!$H$33)+K12*L_Mazout2_to_kgGES+M12*IF(U_Prop=\"[l]\",L_Propane_to_kgGES,Conversion!$H$37)+O12*kg_Bois8_to_kgGES+Q12*kg_Bois35_to_kgGES+S12*lbs_vapeur_to_kgGES+U12*MBTU_eaurefroidie_to_kgGES+W12*MBTU_eauchaude_to_kgGES)/1000","v":0},0,0.8,{"$f":"SUM(AE9:AE11)","v":488.2},9]
["2017-08-01",null,null,null,null,null,null,null,null,null,null,null,null,null,null,null,null,null,null,null,null,null,null,null,0,0,"","",{"$f":"(C13*kWh_Élect_to_kgGES+E13*IF(U_GNat=\"[m³]\",m3_GazNat_to_kgGES,Conversion!$H$29)+G13*IF(U_Ma2=\"[l]\",L_Mazout2_to_kgGES,Conversion!$H$31)+I13*IF(U_Ma6=\"[l]\",L_Mazout6_to_kgGES,Conversion!$H$33)+K13*L_Mazout2_to_kgGES+M13*IF(U_Prop=\"[l]\",L_Propane_to_kgGES,Conversion!$H$37)+O13*kg_Bois8_to_kgGES+Q13*kg_Bois35_to_kgGES+S13*lbs_vapeur_to_kgGES+U13*MBTU_eaurefroidie_to_kgGES+W13*MBTU_eauchaude_to_kgGES)/1000","v":0},0,14,{"$f":"SUM(AE9:AE12)","v":489},8]
["2017-09-01",null,null,null,null,null,null,null,null,null,null,null,null,null,null,null,null,null,null,null,null,null,null,null,0,0,"","",{"$f":"(C14*kWh_Élect_to_kgGES+E14*IF(U_GNat=\"[m³]\",m3_GazNat_to_kgGES,Conversion!$H$29)+G14*IF(U_Ma2=\"[l]\",L_Mazout2_to_kgGES,Conversion!$H$31)+I14*IF(U_Ma6=\"[l]\",L_Mazout6_to_kgGES,Conversion!$H$33)+K14*L_Mazout2_to_kgGES+M14*IF(U_Prop=\"[l]\",L_Propane_to_kgGES,Conversion!$H$37)+O14*kg_Bois8_to_kgGES+Q14*kg_Bois35_to_kgGES+S14*lbs_vapeur_to_kgGES+U14*MBTU_eaurefroidie_to_kgGES+W14*MBTU_eauchaude_to_kgGES)/1000","v":0},0,51.8,{"$f":"SUM(AE9:AE13)","v":503},7]
["2017-10-01",null,null,null,null,null,null,null,null,null,null,null,null,null,null,null,null,null,null,null,null,null,null,null,0,0,"","",{"$f":"(C15*kWh_Élect_to_kgGES+E15*IF(U_GNat=\"[m³]\",m3_GazNat_to_kgGES,Conversion!$H$29)+G15*IF(U_Ma2=\"[l]\",L_Mazout2_to_kgGES,Conversion!$H$31)+I15*IF(U_Ma6=\"[l]\",L_Mazout6_to_kgGES,Conversion!$H$33)+K15*L_Mazout2_to_kgGES+M15*IF(U_Prop=\"[l]\",L_Propane_to_kgGES,Conversion!$H$37)+O15*kg_Bois8_to_kgGES+Q15*kg_Bois35_to_kgGES+S15*lbs_vapeur_to_kgGES+U15*MBTU_eaurefroidie_to_kgGES+W15*MBTU_eauchaude_to_kgGES)/1000","v":0},0,14,{"$f":"SUM(AE9:AE14)","v":554.79999999999995},6]
["2017-11-01",null,null,null,null,null,null,null,null,null,null,null,null,null,null,null,null,null,null,null,null,null,null,null,0,0,"","",{"$f":"(C16*kWh_Élect_to_kgGES+E16*IF(U_GNat=\"[m³]\",m3_GazNat_to_kgGES,Conversion!$H$29)+G16*IF(U_Ma2=\"[l]\",L_Mazout2_to_kgGES,Conversion!$H$31)+I16*IF(U_Ma6=\"[l]\",L_Mazout6_to_kgGES,Conversion!$H$33)+K16*L_Mazout2_to_kgGES+M16*IF(U_Prop=\"[l]\",L_Propane_to_kgGES,Conversion!$H$37)+O16*kg_Bois8_to_kgGES+Q16*kg_Bois35_to_kgGES+S16*lbs_vapeur_to_kgGES+U16*MBTU_eaurefroidie_to_kgGES+W16*MBTU_eauchaude_to_kgGES)/1000","v":0},0,479.5,{"$f":"SUM(AE9:AE15)","v":568.79999999999995},5]
["2017-12-01",null,null,null,null,null,null,null,null,null,null,null,null,null,null,null,null,null,null,null,null,null,null,null,0,0,"","",{"$f":"(C17*kWh_Élect_to_kgGES+E17*IF(U_GNat=\"[m³]\",m3_GazNat_to_kgGES,Conversion!$H$29)+G17*IF(U_Ma2=\"[l]\",L_Mazout2_to_kgGES,Conversion!$H$31)+I17*IF(U_Ma6=\"[l]\",L_Mazout6_to_kgGES,Conversion!$H$33)+K17*L_Mazout2_to_kgGES+M17*IF(U_Prop=\"[l]\",L_Propane_to_kgGES,Conversion!$H$37)+O17*kg_Bois8_to_kgGES+Q17*kg_Bois35_to_kgGES+S17*lbs_vapeur_to_kgGES+U17*MBTU_eaurefroidie_to_kgGES+W17*MBTU_eauchaude_to_kgGES)/1000","v":0},0,823.6,{"$f":"SUM(AE9:AE16)","v":1048.3},4]
["2018-01-01",null,null,null,null,null,null,null,null,null,null,null,null,null,null,null,null,null,null,null,null,null,null,null,0,0,"","",{"$f":"(C18*kWh_Élect_to_kgGES+E18*IF(U_GNat=\"[m³]\",m3_GazNat_to_kgGES,Conversion!$H$29)+G18*IF(U_Ma2=\"[l]\",L_Mazout2_to_kgGES,Conversion!$H$31)+I18*IF(U_Ma6=\"[l]\",L_Mazout6_to_kgGES,Conversion!$H$33)+K18*L_Mazout2_to_kgGES+M18*IF(U_Prop=\"[l]\",L_Propane_to_kgGES,Conversion!$H$37)+O18*kg_Bois8_to_kgGES+Q18*kg_Bois35_to_kgGES+S18*lbs_vapeur_to_kgGES+U18*MBTU_eaurefroidie_to_kgGES+W18*MBTU_eauchaude_to_kgGES)/1000","v":0},0,859.2,{"$f":"SUM(AE9:AE17)","v":1871.9},3]
["2018-02-01",null,null,null,null,null,null,null,null,null,null,null,null,null,null,null,null,null,null,null,null,null,null,null,0,0,"","",{"$f":"(C19*kWh_Élect_to_kgGES+E19*IF(U_GNat=\"[m³]\",m3_GazNat_to_kgGES,Conversion!$H$29)+G19*IF(U_Ma2=\"[l]\",L_Mazout2_to_kgGES,Conversion!$H$31)+I19*IF(U_Ma6=\"[l]\",L_Mazout6_to_kgGES,Conversion!$H$33)+K19*L_Mazout2_to_kgGES+M19*IF(U_Prop=\"[l]\",L_Propane_to_kgGES,Conversion!$H$37)+O19*kg_Bois8_to_kgGES+Q19*kg_Bois35_to_kgGES+S19*lbs_vapeur_to_kgGES+U19*MBTU_eaurefroidie_to_kgGES+W19*MBTU_eauchaude_to_kgGES)/1000","v":0},0,631.79999999999995,{"$f":"SUM(AE9:AE18)","v":2731.1000000000004},2]
["2018-03-01",null,null,null,null,null,null,null,null,null,null,null,null,null,null,null,null,null,null,null,null,null,null,null,0,0,"","",{"$f":"(C20*kWh_Élect_to_kgGES+E20*IF(U_GNat=\"[m³]\",m3_GazNat_to_kgGES,Conversion!$H$29)+G20*IF(U_Ma2=\"[l]\",L_Mazout2_to_kgGES,Conversion!$H$31)+I20*IF(U_Ma6=\"[l]\",L_Mazout6_to_kgGES,Conversion!$H$33)+K20*L_Mazout2_to_kgGES+M20*IF(U_Prop=\"[l]\",L_Propane_to_kgGES,Conversion!$H$37)+O20*kg_Bois8_to_kgGES+Q20*kg_Bois35_to_kgGES+S20*lbs_vapeur_to_kgGES+U20*MBTU_eaurefroidie_to_kgGES+W20*MBTU_eauchaude_to_kgGES)/1000","v":0},0,586.5,{"$f":"SUM(AE9:AE19)","v":3362.9000000000005},1]
["TOTAL/moyenne",{"$f":"IF(ISERROR(AVERAGE(B9:B20)),0,AVERAGE(B9:B20))","v":0},{"$f":"SUM(C9:C20)","v":0},{"$f":"SUM(D9:D20)","v":0},{"$f":"SUM(E9:E20)","v":0},{"$f":"SUM(F9:F20)","v":0},0,{"$f":"SUM(H9:H20)","v":0},0,0,0,0,0,0,0,0,0,0,0,0,0,0,0,0,{"$f":"C21*kWh_Élect_to_GJ+E21*m3_GazNat_to_GJ+G21*L_Mazout2_to_GJ+I21*L_Mazout6_to_GJ+K21*L_Mazout2_to_GJ+M21*L_Propane_to_GJ+O21*kg_Bois8_to_GJ+Q21*kg_Bois35_to_GJ+S21*lbs_vapeur_to_GJ+U21*MBTU_eaurefroidie_to_GJ+W21*MBTU_eauchaude_to_GJ","v":0},{"$f":"D21+F21+H21+J21+L21+N21+P21+R21+T21+V21+X21","v":0},"","",{"$f":"(C21*kWh_Élect_to_kgGES+E21*IF(U_GNat=\"[m³]\",m3_GazNat_to_kgGES,Conversion!$H$29)+G21*IF(U_Ma2=\"[l]\",L_Mazout2_to_kgGES,Conversion!$H$31)+I21*IF(U_Ma6=\"[l]\",L_Mazout6_to_kgGES,Conversion!$H$33)+K21*L_Mazout2_to_kgGES+M21*IF(U_Prop=\"[l]\",L_Propane_to_kgGES,Conversion!$H$37)+O21*kg_Bois8_to_kgGES+Q21*kg_Bois35_to_kgGES+S21*lbs_vapeur_to_kgGES+U21*MBTU_eaurefroidie_to_kgGES+W21*MBTU_eauchaude_to_kgGES)/1000","v":0},0,{"$f":"SUM(AE9:AE20)","v":3949.4000000000005}]
[2017,"Sup_17-18","Elec_kWh_17-18","Elec_CAD_17-18","GN_m³_17-18","GN_CAD_17-18","Ma2_l_17-18","Ma2_CAD_17-18","Ma6_l_17-18","Ma6_CAD_17-18","Prop_l_17-18","Prop_CAD_17-18","Bois20_1000kg_17-18","Bois20_CAD_17-18","Bois45_1000kg_17-18","Bois45_CAD_17-18",null,null,null,null,null,null,"GJ_Tot_17-18","CAD_Tot_17-18","GJm²_17-18","CAD/m²_17-18","GES_ton_17-18","GES_ton/m²_17-18","DJC_tot_17-18"]
["Nombre de bâtiments en propriété ou location, pour lesquels des factures d'énergie sont payées par l'organisation :"]
[]
["ATTENTION, la saisie des consommations d'énergie comporte une erreur si la cellule AA21 est ombragée d'une couleur !",null,null,null,null,null,null,null,null,null,null,null,null,null,null,null,null,null,null,null,null,null,null,null,{"$f":"Lim_bas","v":0},{"$f":"Lim_haut","v":0}]
[]
["QUESTIONS SPÉCIFIQUES (cocher si applicable)"]
[]
["1."]
["2."]
["3."]
["4."]
["5."]
[]
["AJUSTEMENTS NON PÉRIODIQUE",null,"Un ajustement correspond à une modification majeure des équipements ou du bâtiment. Un ajustement peut avoir un impact positif ou négatif sur la consommation énergétique: \n    - un impact positif correspond à une augmentation majeure de la consommation, suite par exemple à l'ajout d'un étage de bâtiment ou à l'ajout de climatisation d'une aile d'un bâtiment.\n    - un impact négatif correspond à une diminution majeure de la consommation. Cette diminution provient non pas d’une économie provenant d’une optimisation du bâtiment mais par exemple de la fermeture d’une partie d'un bâtiment qui devient alors inoccupé.                                                                                                                                                                                                                                                 \nPar exemple : l'ajout de locaux implique une augmentation nette des charges de chauffage et d'éclairage de 500 kWh, telles que calculées par une firme d'ingénieurs. Dans ce fichier, le projet sera noté « Agrandissement » impliquant une augmentation de l'électricité de 500 kWh. Comme il s'agit de chauffage, l'ajustement est sensible au chauffage. La date d'implantation correspond au mois où l'impact sur la consommation a été effectif.\nSi l'ajustement a eu un impact sur plus qu'une source d'énergie, merci de rajouter une ligne pour chaque source touchée.\n"]
[]
[null,"Projet","Tendance de l'impact","Source d'énergie touchée","Impact Annuel",null,"Ajustement sensible au chauffage","Date d'implantation","Impact pour l'année complète [GJ]","Impact pour l'année en cours [GJ]",null,null,null,null,null,null,null,null,null,null,null,null,null,"Énergie de l'année de référence ajustée",{"$f":"((1-Facteur_variable)+Facteur_variable*DJC_tot_17_18/DJC_tot_09_10)*GJ_Tot_09_10+GJ_Ajust_NP_Cour_17_18","v":0},"GJTotRef_Ajust_17_18"]
[null,"Nom du projet #1",null,null,null,{"$f":"IF(D38=\"électrique\",\"kWh\",IF(D38=\"Gaz naturel\",\"m³\",IF(LEFT(D38,1)=\"R\",\"1000 kg\",\"l\")))","v":"l"},null,null,{"$f":"IF(COUNTA(G38)=1,IF(C38=\"Réduction\",-1,IF(C38=\"Augmentation\",1,0))*E38*INDEX(Conversion!$A$26:$J$42,MATCH(D38,Conversion!$J$26:$J$42,0),9),0)","v":0},{"$f":"IF(G38=\"Non\",I38*L38,IF(G38=\"Oui\",I38*K38,0))","v":0},{"$f":"(DJC_tot_17_18-INDEX($A$9:$AF$20,MATCH(H38,$A$9:$A$20,0),24))/DJC_tot_17_18","v":{"$error":"#N/A"}},{"$f":"INDEX($A$9:$AG$20,MATCH(H38,$A$9:$A$20,0),25)/12","v":{"$error":"#N/A"}},null,null,null,null,null,null,null,null,null,null,null,"Énergie de l'année de suivi",{"$f":"GJ_Tot_17_18","v":0}]
[null,"Nom du projet #2",null,null,null,{"$f":"IF(D39=\"électrique\",\"kWh\",IF(D39=\"Gaz naturel\",\"m³\",IF(LEFT(D39,1)=\"R\",\"1000 kg\",\"l\")))","v":"l"},null,null,{"$f":"IF(COUNTA(G39)=1,IF(C39=\"Réduction\",-1,IF(C39=\"Augmentation\",1,0))*E39*INDEX(Conversion!$A$26:$J$42,MATCH(D39,Conversion!$J$26:$J$42,0),9),0)","v":0},0,{"$error":"#N/A"},{"$error":"#N/A"},null,null,null,null,null,null,null,null,null,null,null,"Superficie de l'année de référence",{"$f":"Sup_09_10","v":0}]
[null,"Nom du projet #3",null,null,null,"l",null,null,{"$f":"IF(COUNTA(G40)=1,IF(C40=\"Réduction\",-1,IF(C40=\"Augmentation\",1,0))*E40*INDEX(Conversion!$A$26:$J$42,MATCH(D40,Conversion!$J$26:$J$42,0),9),0)","v":0},0,{"$error":"#N/A"},{"$error":"#N/A"},null,null,null,null,null,null,null,null,null,null,null,"Superficie de l'année de suivi",{"$f":"Sup_17_18","v":0}]
[null,"Nom du projet #4",null,null,null,"l",null,null,{"$f":"IF(COUNTA(G41)=1,IF(C41=\"Réduction\",-1,IF(C41=\"Augmentation\",1,0))*E41*INDEX(Conversion!$A$26:$J$42,MATCH(D41,Conversion!$J$26:$J$42,0),9),0)","v":0},0,{"$error":"#N/A"},{"$error":"#N/A"},null,null,null,null,null,null,null,null,null,null,null,null,{"$f":"GJTotRef_Ajust_17_18/Sup_09_10","v":{"$error":"#DIV/0!"}},"GJTotRef_Ajust_m²_17_18"]
[null,"Nom du projet #5",null,null,null,"l",null,null,{"$f":"IF(COUNTA(G42)=1,IF(C42=\"Réduction\",-1,IF(C42=\"Augmentation\",1,0))*E42*INDEX(Conversion!$A$26:$J$42,MATCH(D42,Conversion!$J$26:$J$42,0),9),0)","v":0},0,{"$error":"#N/A"},{"$error":"#N/A"},null,null,null,null,null,null,null,null,null,null,null,null,{"$f":"J45","v":0},"GJ_Ajust_NP_Cour_17_18"]
[null,"Nom du projet #6",null,null,null,"l",null,null,{"$f":"IF(COUNTA(G43)=1,IF(C43=\"Réduction\",-1,IF(C43=\"Augmentation\",1,0))*E43*INDEX(Conversion!$A$26:$J$42,MATCH(D43,Conversion!$J$26:$J$42,0),9),0)","v":0},0,{"$error":"#N/A"},{"$error":"#N/A"},null,null,null,null,null,null,null,null,null,null,null,null,{"$f":"I45","v":0},"GJ_Ajust_NP_annuel_17_18"]
[null,"Nom du projet #7",null,null,null,"l",null,null,{"$f":"IF(COUNTA(G44)=1,IF(C44=\"Réduction\",-1,IF(C44=\"Augmentation\",1,0))*E44*INDEX(Conversion!$A$26:$J$42,MATCH(D44,Conversion!$J$26:$J$42,0),9),0)","v":0},0,{"$error":"#N/A"},{"$error":"#N/A"}]
[null,"TOTAL",null,null,null,null,null,null,{"$f":"SUM(I38:I44)","v":0},{"$f":"SUM(J38:J44)","v":0}]
[]
[]
[]
[]
[]
[]
[]
[]
[null,null,"Réduction","Électrique",null,null,"Oui"]
[null,null,"Augmentation","Gaz naturel",null,null,"Non"]
[null,null,null,"Mazout n°2"]
[null,null,null,"Mazout n°6"]
[null,null,null,"Propane"]
[null,null,null,"Résidus de bois (20%humidité)"]
[null,null,null,"Résidus de bois (45%humidité)"]
[null,null,null,"-"]

{"sheet":"2018-2019","index":11,"n_rows":61,"n_cols":33,"rows_kept":61,"cut":false,"hidden":false,"merged":[[6,12,6,13],[34,0,34,1],[34,2,34,11],[6,0,7,0],[6,2,6,3],[6,4,6,5],[6,10,6,11],[24,0,24,8],[6,6,6,7],[6,8,6,9],[6,18,6,19],[6,20,6,21],[6,26,6,27],[6,28,6,29],[6,14,6,15],[6,22,6,23],[6,16,6,17],[6,24,6,25]]}
[]
[null,null,null,"Saisir les données énergétiques et les données sur les dépenses annuelles, avant taxes, dans les cellules ombragées en bleu pâle."]
[null,null,null,"Pour les fins du MERN, la saisie mensuelle des données est optionnelle. Les espaces pour saisir mensuellement les données sont mises à la disposition des MO afin de leur permettre de suivre périodiquement la consommation."]
[null,null,null,"Dans le cas où un projet ayant un effet sur la consommation énergétique a eu lieu au cours de l'année (rénovation, agrandissement, etc.), "]
[null,null,null,"veuillez remplir la section « AJUSTEMENTS NON PÉRIODIQUES », ci-dessous."]
[]
["<-- Résumé","Superficie","Consommation électrique",null,"Gaz naturel",null,"Mazout n°2 ",null,"Mazout n°6",null,"Diesel (génératrice)",null,"Propane",null,"Résidus de bois\n (20% d'humidité)",null,"Résidus de bois\n(45% d'humidité)",null,"Vapeur",null,"Eau refroidie",null,"Eau chaude",null,"TOTAL",null,"Intensité Énergétique",null,"GES",null,"DJC"]
[null,"[m²]","[kWh]","[$]","[m³]","[$]","[l]","[$]","[l]","[$]","[l]","[$]","[l]","[$]","[1000 kg MG]","[$]","[1000 kg MG]","[$]","[lbs]","[$]","[MBTU]","[$]","[MBTU]","[$]"," [GJ]","[$]","[GJ/m²]","[$/m²]","[Ton CO2 eq]","[kg CO2 eq/m²]"," [° C]"]
[{"$f":"VALUE(CONCATENATE(LEFT(Annee_financiere,FIND(\"-\",Annee_financiere)-1),\"-\",A22))","v":"2018-04-01"},null,null,null,null,null,null,null,null,null,null,null,null,null,null,null,null,null,null,null,null,null,null,null,{"$f":"C9*kWh_Élect_to_GJ+E9*m3_GazNat_to_GJ+G9*L_Mazout2_to_GJ+I9*L_Mazout6_to_GJ+K9*L_Mazout2_to_GJ+M9*L_Propane_to_GJ+O9*kg_Bois8_to_GJ+Q9*kg_Bois35_to_GJ+S9*lbs_vapeur_to_GJ+U9*MBTU_eaurefroidie_to_GJ+W9*MBTU_eauchaude_to_GJ","v":0},{"$f":"D9+F9+H9+J9+N9+P9+R9+T9+V9+X9+L9","v":0},{"$f":"IF(ISERROR(Y9/B9),\"\",Y9/B9)","v":""},{"$f":"IF(ISERROR(Z9/B9),\"\",Z9/B9)","v":""},{"$f":"(C9*kWh_Élect_to_kgGES+E9*IF(U_GNat=\"[m³]\",m3_GazNat_to_kgGES,Conversion!$H$29)+G9*IF(U_Ma2=\"[l]\",L_Mazout2_to_kgGES,Conversion!$H$31)+I9*IF(U_Ma6=\"[l]\",L_Mazout6_to_kgGES,Conversion!$H$33)+K9*L_Mazout2_to_kgGES+M9*IF(U_Prop=\"[l]\",L_Propane_to_kgGES,Conversion!$H$37)+O9*kg_Bois8_to_kgGES+Q9*kg_Bois35_to_kgGES+S9*lbs_vapeur_to_kgGES+U9*MBTU_eaurefroidie_to_kgGES+W9*MBTU_eauchaude_to_kgGES)/1000","v":0},{"$f":"(IF(ISERROR(AC9/B9),0,(AC9/B9)))*1000","v":0},{"$f":"INDEX(plage_DJ,MATCH(A9,plage_date),3)","v":422.4},null,12]
[{"$f":"DATE(YEAR(A9),MONTH(A9)+1,DAY(A9))","v":"2018-05-01"},null,null,null,null,null,null,null,null,null,null,null,null,null,null,null,null,null,null,null,null,null,null,null,{"$f":"C10*kWh_Élect_to_GJ+E10*m3_GazNat_to_GJ+G10*L_Mazout2_to_GJ+I10*L_Mazout6_to_GJ+K10*L_Mazout2_to_GJ+M10*L_Propane_to_GJ+O10*kg_Bois8_to_GJ+Q10*kg_Bois35_to_GJ+S10*lbs_vapeur_to_GJ+U10*MBTU_eaurefroidie_to_GJ+W10*MBTU_eauchaude_to_GJ","v":0},{"$f":"D10+F10+H10+J10+N10+P10+R10+T10+V10+X10+L10","v":0},"","",{"$f":"(C10*kWh_Élect_to_kgGES+E10*IF(U_GNat=\"[m³]\",m3_GazNat_to_kgGES,Conversion!$H$29)+G10*IF(U_Ma2=\"[l]\",L_Mazout2_to_kgGES,Conversion!$H$31)+I10*IF(U_Ma6=\"[l]\",L_Mazout6_to_kgGES,Conversion!$H$33)+K10*L_Mazout2_to_kgGES+M10*IF(U_Prop=\"[l]\",L_Propane_to_kgGES,Conversion!$H$37)+O10*kg_Bois8_to_kgGES+Q10*kg_Bois35_to_kgGES+S10*lbs_vapeur_to_kgGES+U10*MBTU_eaurefroidie_to_kgGES+W10*MBTU_eauchaude_to_kgGES)/1000","v":0},0,80.099999999999994,{"$f":"SUM(AE9)","v":422.4},11]
[{"$f":"DATE(YEAR(A10),MONTH(A10)+1,DAY(A10))","v":"2018-06-01"},null,null,null,null,null,null,null,null,null,null,null,null,null,null,null,null,null,null,null,null,null,null,null,0,0,"","",{"$f":"(C11*kWh_Élect_to_kgGES+E11*IF(U_GNat=\"[m³]\",m3_GazNat_to_kgGES,Conversion!$H$29)+G11*IF(U_Ma2=\"[l]\",L_Mazout2_to_kgGES,Conversion!$H$31)+I11*IF(U_Ma6=\"[l]\",L_Mazout6_to_kgGES,Conversion!$H$33)+K11*L_Mazout2_to_kgGES+M11*IF(U_Prop=\"[l]\",L_Propane_to_kgGES,Conversion!$H$37)+O11*kg_Bois8_to_kgGES+Q11*kg_Bois35_to_kgGES+S11*lbs_vapeur_to_kgGES+U11*MBTU_eaurefroidie_to_kgGES+W11*MBTU_eauchaude_to_kgGES)/1000","v":0},0,27.1,{"$f":"SUM(AE9:AE10)","v":502.5},10]
["2018-07-01",null,null,null,null,null,null,null,null,null,null,null,null,null,null,null,null,null,null,null,null,null,null,null,0,0,"","",{"$f":"(C12*kWh_Élect_to_kgGES+E12*IF(U_GNat=\"[m³]\",m3_GazNat_to_kgGES,Conversion!$H$29)+G12*IF(U_Ma2=\"[l]\",L_Mazout2_to_kgGES,Conversion!$H$31)+I12*IF(U_Ma6=\"[l]\",L_Mazout6_to_kgGES,Conversion!$H$33)+K12*L_Mazout2_to_kgGES+M12*IF(U_Prop=\"[l]\",L_Propane_to_kgGES,Conversion!$H$37)+O12*kg_Bois8_to_kgGES+Q12*kg_Bois35_to_kgGES+S12*lbs_vapeur_to_kgGES+U12*MBTU_eaurefroidie_to_kgGES+W12*MBTU_eauchaude_to_kgGES)/1000","v":0},0,0,{"$f":"SUM(AE9:AE11)","v":529.6},9]
["2018-08-01",null,null,null,null,null,null,null,null,null,null,null,null,null,null,null,null,null,null,null,null,null,null,null,0,0,"","",{"$f":"(C13*kWh_Élect_to_kgGES+E13*IF(U_GNat=\"[m³]\",m3_GazNat_to_kgGES,Conversion!$H$29)+G13*IF(U_Ma2=\"[l]\",L_Mazout2_to_kgGES,Conversion!$H$31)+I13*IF(U_Ma6=\"[l]\",L_Mazout6_to_kgGES,Conversion!$H$33)+K13*L_Mazout2_to_kgGES+M13*IF(U_Prop=\"[l]\",L_Propane_to_kgGES,Conversion!$H$37)+O13*kg_Bois8_to_kgGES+Q13*kg_Bois35_to_kgGES+S13*lbs_vapeur_to_kgGES+U13*MBTU_eaurefroidie_to_kgGES+W13*MBTU_eauchaude_to_kgGES)/1000","v":0},0,0.1,{"$f":"SUM(AE9:AE12)","v":529.6},8]
["2018-09-01",null,null,null,null,null,null,null,null,null,null,null,null,null,null,null,null,null,null,null,null,null,null,null,0,0,"","",{"$f":"(C14*kWh_Élect_to_kgGES+E14*IF(U_GNat=\"[m³]\",m3_GazNat_to_kgGES,Conversion!$H$29)+G14*IF(U_Ma2=\"[l]\",L_Mazout2_to_kgGES,Conversion!$H$31)+I14*IF(U_Ma6=\"[l]\",L_Mazout6_to_kgGES,Conversion!$H$33)+K14*L_Mazout2_to_kgGES+M14*IF(U_Prop=\"[l]\",L_Propane_to_kgGES,Conversion!$H$37)+O14*kg_Bois8_to_kgGES+Q14*kg_Bois35_to_kgGES+S14*lbs_vapeur_to_kgGES+U14*MBTU_eaurefroidie_to_kgGES+W14*MBTU_eauchaude_to_kgGES)/1000","v":0},0,69.7,{"$f":"SUM(AE9:AE13)","v":529.70000000000005},7]
["2018-10-01",null,null,null,null,null,null,null,null,null,null,null,null,null,null,null,null,null,null,null,null,null,null,null,0,0,"","",{"$f":"(C15*kWh_Élect_to_kgGES+E15*IF(U_GNat=\"[m³]\",m3_GazNat_to_kgGES,Conversion!$H$29)+G15*IF(U_Ma2=\"[l]\",L_Mazout2_to_kgGES,Conversion!$H$31)+I15*IF(U_Ma6=\"[l]\",L_Mazout6_to_kgGES,Conversion!$H$33)+K15*L_Mazout2_to_kgGES+M15*IF(U_Prop=\"[l]\",L_Propane_to_kgGES,Conversion!$H$37)+O15*kg_Bois8_to_kgGES+Q15*kg_Bois35_to_kgGES+S15*lbs_vapeur_to_kgGES+U15*MBTU_eaurefroidie_to_kgGES+W15*MBTU_eauchaude_to_kgGES)/1000","v":0},0,262.39999999999998,{"$f":"SUM(AE9:AE14)","v":599.40000000000009},6]
["2018-11-01",null,null,null,null,null,null,null,null,null,null,null,null,null,null,null,null,null,null,null,null,null,null,null,0,0,"","",{"$f":"(C16*kWh_Élect_to_kgGES+E16*IF(U_GNat=\"[m³]\",m3_GazNat_to_kgGES,Conversion!$H$29)+G16*IF(U_Ma2=\"[l]\",L_Mazout2_to_kgGES,Conversion!$H$31)+I16*IF(U_Ma6=\"[l]\",L_Mazout6_to_kgGES,Conversion!$H$33)+K16*L_Mazout2_to_kgGES+M16*IF(U_Prop=\"[l]\",L_Propane_to_kgGES,Conversion!$H$37)+O16*kg_Bois8_to_kgGES+Q16*kg_Bois35_to_kgGES+S16*lbs_vapeur_to_kgGES+U16*MBTU_eaurefroidie_to_kgGES+W16*MBTU_eauchaude_to_kgGES)/1000","v":0},0,543.5,{"$f":"SUM(AE9:AE15)","v":861.80000000000007},5]
["2018-12-01",null,null,null,null,null,null,null,null,null,null,null,null,null,null,null,null,null,null,null,null,null,null,null,0,0,"","",{"$f":"(C17*kWh_Élect_to_kgGES+E17*IF(U_GNat=\"[m³]\",m3_GazNat_to_kgGES,Conversion!$H$29)+G17*IF(U_Ma2=\"[l]\",L_Mazout2_to_kgGES,Conversion!$H$31)+I17*IF(U_Ma6=\"[l]\",L_Mazout6_to_kgGES,Conversion!$H$33)+K17*L_Mazout2_to_kgGES+M17*IF(U_Prop=\"[l]\",L_Propane_to_kgGES,Conversion!$H$37)+O17*kg_Bois8_to_kgGES+Q17*kg_Bois35_to_kgGES+S17*lbs_vapeur_to_kgGES+U17*MBTU_eaurefroidie_to_kgGES+W17*MBTU_eauchaude_to_kgGES)/1000","v":0},0,689.3,{"$f":"SUM(AE9:AE16)","v":1405.3000000000002},4]
["2019-01-01",null,null,null,null,null,null,null,null,null,null,null,null,null,null,null,null,null,null,null,null,null,null,null,0,0,"","",{"$f":"(C18*kWh_Élect_to_kgGES+E18*IF(U_GNat=\"[m³]\",m3_GazNat_to_kgGES,Conversion!$H$29)+G18*IF(U_Ma2=\"[l]\",L_Mazout2_to_kgGES,Conversion!$H$31)+I18*IF(U_Ma6=\"[l]\",L_Mazout6_to_kgGES,Conversion!$H$33)+K18*L_Mazout2_to_kgGES+M18*IF(U_Prop=\"[l]\",L_Propane_to_kgGES,Conversion!$H$37)+O18*kg_Bois8_to_kgGES+Q18*kg_Bois35_to_kgGES+S18*lbs_vapeur_to_kgGES+U18*MBTU_eaurefroidie_to_kgGES+W18*MBTU_eauchaude_to_kgGES)/1000","v":0},0,877.4,{"$f":"SUM(AE9:AE17)","v":2094.6000000000004},3]
["2019-02-01",null,null,null,null,null,null,null,null,null,null,null,null,null,null,null,null,null,null,null,null,null,null,null,0,0,"","",{"$f":"(C19*kWh_Élect_to_kgGES+E19*IF(U_GNat=\"[m³]\",m3_GazNat_to_kgGES,Conversion!$H$29)+G19*IF(U_Ma2=\"[l]\",L_Mazout2_to_kgGES,Conversion!$H$31)+I19*IF(U_Ma6=\"[l]\",L_Mazout6_to_kgGES,Conversion!$H$33)+K19*L_Mazout2_to_kgGES+M19*IF(U_Prop=\"[l]\",L_Propane_to_kgGES,Conversion!$H$37)+O19*kg_Bois8_to_kgGES+Q19*kg_Bois35_to_kgGES+S19*lbs_vapeur_to_kgGES+U19*MBTU_eaurefroidie_to_kgGES+W19*MBTU_eauchaude_to_kgGES)/1000","v":0},0,736.4,{"$f":"SUM(AE9:AE18)","v":2972.0000000000005},2]
["2019-03-01",null,null,null,null,null,null,null,null,null,null,null,null,null,null,null,null,null,null,null,null,null,null,null,0,0,"","",{"$f":"(C20*kWh_Élect_to_kgGES+E20*IF(U_GNat=\"[m³]\",m3_GazNat_to_kgGES,Conversion!$H$29)+G20*IF(U_Ma2=\"[l]\",L_Mazout2_to_kgGES,Conversion!$H$31)+I20*IF(U_Ma6=\"[l]\",L_Mazout6_to_kgGES,Conversion!$H$33)+K20*L_Mazout2_to_kgGES+M20*IF(U_Prop=\"[l]\",L_Propane_to_kgGES,Conversion!$H$37)+O20*kg_Bois8_to_kgGES+Q20*kg_Bois35_to_kgGES+S20*lbs_vapeur_to_kgGES+U20*MBTU_eaurefroidie_to_kgGES+W20*MBTU_eauchaude_to_kgGES)/1000","v":0},0,638.79999999999995,{"$f":"SUM(AE9:AE19)","v":3708.4000000000005},1]
["TOTAL/moyenne",{"$f":"IF(ISERROR(AVERAGE(B9:B20)),0,AVERAGE(B9:B20))","v":0},{"$f":"SUM(C9:C20)","v":0},0,0,0,0,0,0,0,0,0,0,0,0,0,0,0,0,0,0,0,0,0,{"$f":"C21*kWh_Élect_to_GJ+E21*m3_GazNat_to_GJ+G21*L_Mazout2_to_GJ+I21*L_Mazout6_to_GJ+K21*L_Mazout2_to_GJ+M21*L_Propane_to_GJ+O21*kg_Bois8_to_GJ+Q21*kg_Bois35_to_GJ+S21*lbs_vapeur_to_GJ+U21*MBTU_eaurefroidie_to_GJ+W21*MBTU_eauchaude_to_GJ","v":0},{"$f":"D21+F21+H21+J21+L21+N21+P21+R21+T21+V21+X21","v":0},"","",{"$f":"(C21*kWh_Élect_to_kgGES+E21*IF(U_GNat=\"[m³]\",m3_GazNat_to_kgGES,Conversion!$H$29)+G21*IF(U_Ma2=\"[l]\",L_Mazout2_to_kgGES,Conversion!$H$31)+I21*IF(U_Ma6=\"[l]\",L_Mazout6_to_kgGES,Conversion!$H$33)+K21*L_Mazout2_to_kgGES+M21*IF(U_Prop=\"[l]\",L_Propane_to_kgGES,Conversion!$H$37)+O21*kg_Bois8_to_kgGES+Q21*kg_Bois35_to_kgGES+S21*lbs_vapeur_to_kgGES+U21*MBTU_eaurefroidie_to_kgGES+W21*MBTU_eauchaude_to_kgGES)/1000","v":0},0,{"$f":"SUM(AE9:AE20)","v":4347.2000000000007}]
[2018,"Sup_18-19","Elec_kWh_18-19","Elec_CAD_18-19","GN_m³_18-19","GN_CAD_18-19","Ma2_l_18-19","Ma2_CAD_18-19","Ma6_l_18-19","Ma6_CAD_18-19","Prop_l_18-19","Prop_CAD_18-19","Bois20_1000kg_18-19","Bois20_CAD_18-19","Bois45_1000kg_18-19","Bois45_CAD_18-19",null,null,null,null,null,null,"GJ_Tot_18-19","CAD_Tot_18-19","GJm²_18-19","CAD/m²_18-19","GES_ton_18-19","GES_ton/m²_18-19","DJC_tot_18-19"]
["Nombre de bâtiments en propriété ou location, pour lesquels des factures d'énergie sont payées par l'organisation :"]
[]
["ATTENTION, la saisie des consommations d'énergie comporte une erreur si la cellule AA21 est ombragée d'une couleur !",null,null,null,null,null,null,null,null,null,null,null,null,null,null,null,null,null,null,null,null,null,null,null,{"$f":"Lim_bas","v":0},{"$f":"Lim_haut","v":0}]
[]
["QUESTIONS SPÉCIFIQUES (cocher si applicable)"]
[]
["1."]
["2."]
["3."]
["4."]
["5."]
[]
["AJUSTEMENTS NON PÉRIODIQUE",null,"Un ajustement correspond à une modification majeure des équipements ou du bâtiment. Un ajustement peut avoir un impact positif ou négatif sur la consommation énergétique: \n    - un impact positif correspond à une augmentation majeure de la consommation, suite par exemple à l'ajout d'un étage de bâtiment ou à l'ajout de climatisation d'une aile d'un bâtiment.\n    - un impact négatif correspond à une diminution majeure de la consommation. Cette diminution provient non pas d’une économie provenant d’une optimisation du bâtiment mais par exemple de la fermeture d’une partie d'un bâtiment qui devient alors inoccupé.                                                                                                                                                                                                                                                 \nPar exemple : l'ajout de locaux implique une augmentation nette des charges de chauffage et d'éclairage de 500 kWh, telles que calculées par une firme d'ingénieurs. Dans ce fichier, le projet sera noté « Agrandissement » impliquant une augmentation de l'électricité de 500 kWh. Comme il s'agit de chauffage, l'ajustement est sensible au chauffage. La date d'implantation correspond au mois où l'impact sur la consommation a été effectif.\nSi l'ajustement a eu un impact sur plus qu'une source d'énergie, merci de rajouter une ligne pour chaque source touchée.\n"]
[]
[null,"Projet","Tendance de l'impact","Source d'énergie touchée","Impact Annuel",null,"Ajustement sensible au chauffage","Date d'implantation","Impact pour l'année complète [GJ]","Impact pour l'année en cours [GJ]",null,null,null,null,null,null,null,null,null,null,null,null,null,"Énergie de l'année de référence ajustée",{"$f":"((1-Facteur_variable)+Facteur_variable*DJC_tot_18_19/DJC_tot_09_10)*GJ_Tot_09_10+GJ_Ajust_NP_Cour_18_19","v":0},"GJTotRef_Ajust_18_19"]
[null,"Nom du projet #1",null,null,null,{"$f":"IF(D38=\"électrique\",\"kWh\",IF(D38=\"Gaz naturel\",\"m³\",IF(LEFT(D38,1)=\"R\",\"1000 kg\",\"l\")))","v":"l"},null,null,{"$f":"IF(COUNTA(G38)=1,IF(C38=\"Réduction\",-1,IF(C38=\"Augmentation\",1,0))*E38*INDEX(Conversion!$A$26:$J$42,MATCH(D38,Conversion!$J$26:$J$42,0),9),0)","v":0},{"$f":"IF(G38=\"Non\",I38*L38,IF(G38=\"Oui\",I38*K38,0))","v":0},{"$f":"(DJC_tot_18_19-INDEX($A$9:$AF$20,MATCH(H38,$A$9:$A$20,0),24))/DJC_tot_18_19","v":{"$error":"#N/A"}},{"$f":"INDEX($A$9:$AG$20,MATCH(H38,$A$9:$A$20,0),25)/12","v":{"$error":"#N/A"}},null,null,null,null,null,null,null,null,null,null,null,"Énergie de l'année de suivi",{"$f":"GJ_Tot_18_19","v":0}]
[null,"Nom du projet #2",null,null,null,{"$f":"IF(D39=\"électrique\",\"kWh\",IF(D39=\"Gaz naturel\",\"m³\",IF(LEFT(D39,1)=\"R\",\"1000 kg\",\"l\")))","v":"l"},null,null,{"$f":"IF(COUNTA(G39)=1,IF(C39=\"Réduction\",-1,IF(C39=\"Augmentation\",1,0))*E39*INDEX(Conversion!$A$26:$J$42,MATCH(D39,Conversion!$J$26:$J$42,0),9),0)","v":0},0,{"$error":"#N/A"},{"$error":"#N/A"},null,null,null,null,null,null,null,null,null,null,null,"Superficie de l'année de référence",{"$f":"Sup_09_10","v":0}]
[null,"Nom du projet #3",null,null,null,"l",null,null,{"$f":"IF(COUNTA(G40)=1,IF(C40=\"Réduction\",-1,IF(C40=\"Augmentation\",1,0))*E40*INDEX(Conversion!$A$26:$J$42,MATCH(D40,Conversion!$J$26:$J$42,0),9),0)","v":0},0,{"$error":"#N/A"},{"$error":"#N/A"},null,null,null,null,null,null,null,null,null,null,null,"Superficie de l'année de suivi",{"$f":"Sup_18_19","v":0}]
[null,"Nom du projet #4",null,null,null,"l",null,null,{"$f":"IF(COUNTA(G41)=1,IF(C41=\"Réduction\",-1,IF(C41=\"Augmentation\",1,0))*E41*INDEX(Conversion!$A$26:$J$42,MATCH(D41,Conversion!$J$26:$J$42,0),9),0)","v":0},0,{"$error":"#N/A"},{"$error":"#N/A"},null,null,null,null,null,null,null,null,null,null,null,null,{"$f":"GJTotRef_Ajust_18_19/Sup_09_10","v":{"$error":"#DIV/0!"}},"GJTotRef_Ajust_m²_18_19"]
[null,"Nom du projet #5",null,null,null,"l",null,null,{"$f":"IF(COUNTA(G42)=1,IF(C42=\"Réduction\",-1,IF(C42=\"Augmentation\",1,0))*E42*INDEX(Conversion!$A$26:$J$42,MATCH(D42,Conversion!$J$26:$J$42,0),9),0)","v":0},0,{"$error":"#N/A"},{"$error":"#N/A"},null,null,null,null,null,null,null,null,null,null,null,null,{"$f":"J45","v":0},"GJ_Ajust_NP_Cour_18_19"]
[null,"Nom du projet #6",null,null,null,"l",null,null,{"$f":"IF(COUNTA(G43)=1,IF(C43=\"Réduction\",-1,IF(C43=\"Augmentation\",1,0))*E43*INDEX(Conversion!$A$26:$J$42,MATCH(D43,Conversion!$J$26:$J$42,0),9),0)","v":0},0,{"$error":"#N/A"},{"$error":"#N/A"},null,null,null,null,null,null,null,null,null,null,null,null,{"$f":"I45","v":0},"GJ_Ajust_NP_annuel_18_19"]
[null,"Nom du projet #7",null,null,null,"l",null,null,{"$f":"IF(COUNTA(G44)=1,IF(C44=\"Réduction\",-1,IF(C44=\"Augmentation\",1,0))*E44*INDEX(Conversion!$A$26:$J$42,MATCH(D44,Conversion!$J$26:$J$42,0),9),0)","v":0},0,{"$error":"#N/A"},{"$error":"#N/A"}]
[null,"TOTAL",null,null,null,null,null,null,{"$f":"SUM(I38:I44)","v":0},{"$f":"SUM(J38:J44)","v":0}]
[]
[]
[]
[]
[]
[]
[]
[]
[null,null,"Réduction","Électrique",null,null,"Oui"]
[null,null,"Augmentation","Gaz naturel",null,null,"Non"]
[null,null,null,"Mazout n°2"]
[null,null,null,"Mazout n°6"]
[null,null,null,"Propane"]
[null,null,null,"Résidus de bois (20%humidité)"]
[null,null,null,"Résidus de bois (45%humidité)"]
[null,null,null,"-"]

{"sheet":"2019-2020","index":12,"n_rows":61,"n_cols":33,"rows_kept":61,"cut":false,"hidden":false,"merged":[[6,12,6,13],[34,0,34,1],[34,2,34,11],[6,0,7,0],[6,2,6,3],[6,4,6,5],[6,10,6,11],[24,0,24,7],[6,6,6,7],[6,8,6,9],[6,18,6,19],[6,20,6,21],[6,26,6,27],[6,28,6,29],[6,14,6,15],[6,22,6,23],[6,16,6,17],[6,24,6,25]]}
[]
[null,null,null,"Saisir les données énergétiques et les données sur les dépenses annuelles, avant taxes, dans les cellules ombragées en bleu pâle."]
[null,null,null,"Pour les fins du MERN, la saisie mensuelle des données est optionnelle. Les espaces pour saisir mensuellement les données sont mises à la disposition des MO afin de leur permettre de suivre périodiquement la consommation."]
[null,null,null,"Dans le cas où un projet ayant un effet sur la consommation énergétique a eu lieu au cours de l'année (rénovation, agrandissement, etc.), "]
[null,null,null,"veuillez remplir la section « AJUSTEMENTS NON PÉRIODIQUES », ci-dessous."]
[]
["<-- Résumé","Superficie","Consommation électrique",null,"Gaz naturel",null,"Mazout n°2 ",null,"Mazout n°6",null,"Diesel (génératrice)",null,"Propane",null,"Résidus de bois\n (20% d'humidité)",null,"Résidus de bois\n(45% d'humidité)",null,"Vapeur",null,"Eau refroidie",null,"Eau chaude",null,"TOTAL",null,"Intensité Énergétique",null,"GES",null,"DJC"]
[null,"[m²]","[kWh]","[$]","[m³]","[$]","[l]","[$]","[l]","[$]","[l]","[$]","[l]","[$]","[1000 kg MG]","[$]","[1000 kg MG]","[$]","[lbs]","[$]","[MBTU]","[$]","[MBTU]","[$]"," [GJ]","[$]","[GJ/m²]","[$/m²]","[Ton CO2 eq]","[kg CO2 eq/m²]"," [° C]"]
[{"$f":"VALUE(CONCATENATE(LEFT(Annee_financiere,FIND(\"-\",Annee_financiere)-1),\"-\",A22))","v":"2019-04-01"},null,null,null,null,null,null,null,null,null,null,null,null,null,null,null,null,null,null,null,null,null,null,null,{"$f":"C9*kWh_Élect_to_GJ+E9*m3_GazNat_to_GJ+G9*L_Mazout2_to_GJ+I9*L_Mazout6_to_GJ+K9*L_Mazout2_to_GJ+M9*L_Propane_to_GJ+O9*kg_Bois8_to_GJ+Q9*kg_Bois35_to_GJ+S9*lbs_vapeur_to_GJ+U9*MBTU_eaurefroidie_to_GJ+W9*MBTU_eauchaude_to_GJ","v":0},{"$f":"D9+F9+H9+J9+N9+P9+R9+T9+V9+X9+L9","v":0},{"$f":"IF(ISERROR(Y9/B9),\"\",Y9/B9)","v":""},{"$f":"IF(ISERROR(Z9/B9),\"\",Z9/B9)","v":""},{"$f":"(C9*kWh_Élect_to_kgGES+E9*IF(U_GNat=\"[m³]\",m3_GazNat_to_kgGES,Conversion!$H$29)+G9*IF(U_Ma2=\"[l]\",L_Mazout2_to_kgGES,Conversion!$H$31)+I9*IF(U_Ma6=\"[l]\",L_Mazout6_to_kgGES,Conversion!$H$33)+K9*IF(U_Ma2=\"[l]\",L_Mazout2_to_kgGES,Conversion!$H$35)+M9*IF(U_Prop=\"[l]\",L_Propane_to_kgGES,Conversion!$H$37)+O9*IF(U_Bois20=\"[1000 kg MG]\",Conversion!$H$38,Conversion!$H$39)+Q9*IF(U_Bois45=\"[1000 kg MG]\",Conversion!$H$40,Conversion!$H$41)+S9*lbs_vapeur_to_kgGES+U9*MBTU_eaurefroidie_to_kgGES+W9*MBTU_eauchaude_to_kgGES)/1000","v":0},{"$f":"(IF(ISERROR(AC9/B9),0,(AC9/B9)))*1000","v":0},{"$f":"INDEX(plage_DJ,MATCH(A9,plage_date),3)","v":377.4},null,12]
[{"$f":"DATE(YEAR(A9),MONTH(A9)+1,DAY(A9))","v":"2019-05-01"},null,null,null,null,null,null,null,null,null,null,null,null,null,null,null,null,null,null,null,null,null,null,null,0,{"$f":"D10+F10+H10+J10+N10+P10+R10+T10+V10+X10+L10","v":0},"","",{"$f":"(C10*kWh_Élect_to_kgGES+E10*IF(U_GNat=\"[m³]\",m3_GazNat_to_kgGES,Conversion!$H$29)+G10*IF(U_Ma2=\"[l]\",L_Mazout2_to_kgGES,Conversion!$H$31)+I10*IF(U_Ma6=\"[l]\",L_Mazout6_to_kgGES,Conversion!$H$33)+K10*IF(U_Ma2=\"[l]\",L_Mazout2_to_kgGES,Conversion!$H$35)+M10*IF(U_Prop=\"[l]\",L_Propane_to_kgGES,Conversion!$H$37)+O10*IF(U_Bois20=\"[1000 kg MG]\",Conversion!$H$38,Conversion!$H$39)+Q10*IF(U_Bois45=\"[1000 kg MG]\",Conversion!$H$40,Conversion!$H$41)+S10*lbs_vapeur_to_kgGES+U10*MBTU_eaurefroidie_to_kgGES+W10*MBTU_eauchaude_to_kgGES)/1000","v":0},0,{"$f":"INDEX(plage_DJ,MATCH(A10,plage_date),3)","v":185.7},{"$f":"SUM(AE9)","v":377.4},11]
[{"$f":"DATE(YEAR(A10),MONTH(A10)+1,DAY(A10))","v":"2019-06-01"},null,null,null,null,null,null,null,null,null,null,null,null,null,null,null,null,null,null,null,null,null,null,null,0,0,"","",{"$f":"(C11*kWh_Élect_to_kgGES+E11*IF(U_GNat=\"[m³]\",m3_GazNat_to_kgGES,Conversion!$H$29)+G11*IF(U_Ma2=\"[l]\",L_Mazout2_to_kgGES,Conversion!$H$31)+I11*IF(U_Ma6=\"[l]\",L_Mazout6_to_kgGES,Conversion!$H$33)+K11*IF(U_Ma2=\"[l]\",L_Mazout2_to_kgGES,Conversion!$H$35)+M11*IF(U_Prop=\"[l]\",L_Propane_to_kgGES,Conversion!$H$37)+O11*IF(U_Bois20=\"[1000 kg MG]\",Conversion!$H$38,Conversion!$H$39)+Q11*IF(U_Bois45=\"[1000 kg MG]\",Conversion!$H$40,Conversion!$H$41)+S11*lbs_vapeur_to_kgGES+U11*MBTU_eaurefroidie_to_kgGES+W11*MBTU_eauchaude_to_kgGES)/1000","v":0},0,41,{"$f":"SUM(AE9:AE10)","v":563.09999999999991},10]
["2019-07-01",null,null,null,null,null,null,null,null,null,null,null,null,null,null,null,null,null,null,null,null,null,null,null,0,0,"","",{"$f":"(C12*kWh_Élect_to_kgGES+E12*IF(U_GNat=\"[m³]\",m3_GazNat_to_kgGES,Conversion!$H$29)+G12*IF(U_Ma2=\"[l]\",L_Mazout2_to_kgGES,Conversion!$H$31)+I12*IF(U_Ma6=\"[l]\",L_Mazout6_to_kgGES,Conversion!$H$33)+K12*IF(U_Ma2=\"[l]\",L_Mazout2_to_kgGES,Conversion!$H$35)+M12*IF(U_Prop=\"[l]\",L_Propane_to_kgGES,Conversion!$H$37)+O12*IF(U_Bois20=\"[1000 kg MG]\",Conversion!$H$38,Conversion!$H$39)+Q12*IF(U_Bois45=\"[1000 kg MG]\",Conversion!$H$40,Conversion!$H$41)+S12*lbs_vapeur_to_kgGES+U12*MBTU_eaurefroidie_to_kgGES+W12*MBTU_eauchaude_to_kgGES)/1000","v":0},0,0,{"$f":"SUM(AE9:AE11)","v":604.09999999999991},9]
["2019-08-01",null,null,null,null,null,null,null,null,null,null,null,null,null,null,null,null,null,null,null,null,null,null,null,0,0,"","",{"$f":"(C13*kWh_Élect_to_kgGES+E13*IF(U_GNat=\"[m³]\",m3_GazNat_to_kgGES,Conversion!$H$29)+G13*IF(U_Ma2=\"[l]\",L_Mazout2_to_kgGES,Conversion!$H$31)+I13*IF(U_Ma6=\"[l]\",L_Mazout6_to_kgGES,Conversion!$H$33)+K13*IF(U_Ma2=\"[l]\",L_Mazout2_to_kgGES,Conversion!$H$35)+M13*IF(U_Prop=\"[l]\",L_Propane_to_kgGES,Conversion!$H$37)+O13*IF(U_Bois20=\"[1000 kg MG]\",Conversion!$H$38,Conversion!$H$39)+Q13*IF(U_Bois45=\"[1000 kg MG]\",Conversion!$H$40,Conversion!$H$41)+S13*lbs_vapeur_to_kgGES+U13*MBTU_eaurefroidie_to_kgGES+W13*MBTU_eauchaude_to_kgGES)/1000","v":0},0,2,{"$f":"SUM(AE9:AE12)","v":604.09999999999991},8]
["2019-09-01",null,null,null,null,null,null,null,null,null,null,null,null,null,null,null,null,null,null,null,null,null,null,null,0,0,"","",{"$f":"(C14*kWh_Élect_to_kgGES+E14*IF(U_GNat=\"[m³]\",m3_GazNat_to_kgGES,Conversion!$H$29)+G14*IF(U_Ma2=\"[l]\",L_Mazout2_to_kgGES,Conversion!$H$31)+I14*IF(U_Ma6=\"[l]\",L_Mazout6_to_kgGES,Conversion!$H$33)+K14*IF(U_Ma2=\"[l]\",L_Mazout2_to_kgGES,Conversion!$H$35)+M14*IF(U_Prop=\"[l]\",L_Propane_to_kgGES,Conversion!$H$37)+O14*IF(U_Bois20=\"[1000 kg MG]\",Conversion!$H$38,Conversion!$H$39)+Q14*IF(U_Bois45=\"[1000 kg MG]\",Conversion!$H$40,Conversion!$H$41)+S14*lbs_vapeur_to_kgGES+U14*MBTU_eaurefroidie_to_kgGES+W14*MBTU_eauchaude_to_kgGES)/1000","v":0},0,78.400000000000006,{"$f":"SUM(AE9:AE13)","v":606.09999999999991},7]
["2019-10-01",null,null,null,null,null,null,null,null,null,null,null,null,null,null,null,null,null,null,null,null,null,null,null,0,0,"","",{"$f":"(C15*kWh_Élect_to_kgGES+E15*IF(U_GNat=\"[m³]\",m3_GazNat_to_kgGES,Conversion!$H$29)+G15*IF(U_Ma2=\"[l]\",L_Mazout2_to_kgGES,Conversion!$H$31)+I15*IF(U_Ma6=\"[l]\",L_Mazout6_to_kgGES,Conversion!$H$33)+K15*IF(U_Ma2=\"[l]\",L_Mazout2_to_kgGES,Conversion!$H$35)+M15*IF(U_Prop=\"[l]\",L_Propane_to_kgGES,Conversion!$H$37)+O15*IF(U_Bois20=\"[1000 kg MG]\",Conversion!$H$38,Conversion!$H$39)+Q15*IF(U_Bois45=\"[1000 kg MG]\",Conversion!$H$40,Conversion!$H$41)+S15*lbs_vapeur_to_kgGES+U15*MBTU_eaurefroidie_to_kgGES+W15*MBTU_eauchaude_to_kgGES)/1000","v":0},0,245.7,{"$f":"SUM(AE9:AE14)","v":684.49999999999989},6]
["2019-11-01",null,null,null,null,null,null,null,null,null,null,null,null,null,null,null,null,null,null,null,null,null,null,null,0,0,"","",{"$f":"(C16*kWh_Élect_to_kgGES+E16*IF(U_GNat=\"[m³]\",m3_GazNat_to_kgGES,Conversion!$H$29)+G16*IF(U_Ma2=\"[l]\",L_Mazout2_to_kgGES,Conversion!$H$31)+I16*IF(U_Ma6=\"[l]\",L_Mazout6_to_kgGES,Conversion!$H$33)+K16*IF(U_Ma2=\"[l]\",L_Mazout2_to_kgGES,Conversion!$H$35)+M16*IF(U_Prop=\"[l]\",L_Propane_to_kgGES,Conversion!$H$37)+O16*IF(U_Bois20=\"[1000 kg MG]\",Conversion!$H$38,Conversion!$H$39)+Q16*IF(U_Bois45=\"[1000 kg MG]\",Conversion!$H$40,Conversion!$H$41)+S16*lbs_vapeur_to_kgGES+U16*MBTU_eaurefroidie_to_kgGES+W16*MBTU_eauchaude_to_kgGES)/1000","v":0},0,533.29999999999995,{"$f":"SUM(AE9:AE15)","v":930.19999999999982},5]
["2019-12-01",null,null,null,null,null,null,null,null,null,null,null,null,null,null,null,null,null,null,null,null,null,null,null,0,0,"","",{"$f":"(C17*kWh_Élect_to_kgGES+E17*IF(U_GNat=\"[m³]\",m3_GazNat_to_kgGES,Conversion!$H$29)+G17*IF(U_Ma2=\"[l]\",L_Mazout2_to_kgGES,Conversion!$H$31)+I17*IF(U_Ma6=\"[l]\",L_Mazout6_to_kgGES,Conversion!$H$33)+K17*IF(U_Ma2=\"[l]\",L_Mazout2_to_kgGES,Conversion!$H$35)+M17*IF(U_Prop=\"[l]\",L_Propane_to_kgGES,Conversion!$H$37)+O17*IF(U_Bois20=\"[1000 kg MG]\",Conversion!$H$38,Conversion!$H$39)+Q17*IF(U_Bois45=\"[1000 kg MG]\",Conversion!$H$40,Conversion!$H$41)+S17*lbs_vapeur_to_kgGES+U17*MBTU_eaurefroidie_to_kgGES+W17*MBTU_eauchaude_to_kgGES)/1000","v":0},0,688.8,{"$f":"SUM(AE9:AE16)","v":1463.4999999999998},4]
["2020-01-01",null,null,null,null,null,null,null,null,null,null,null,null,null,null,null,null,null,null,null,null,null,null,null,0,0,"","",{"$f":"(C18*kWh_Élect_to_kgGES+E18*IF(U_GNat=\"[m³]\",m3_GazNat_to_kgGES,Conversion!$H$29)+G18*IF(U_Ma2=\"[l]\",L_Mazout2_to_kgGES,Conversion!$H$31)+I18*IF(U_Ma6=\"[l]\",L_Mazout6_to_kgGES,Conversion!$H$33)+K18*IF(U_Ma2=\"[l]\",L_Mazout2_to_kgGES,Conversion!$H$35)+M18*IF(U_Prop=\"[l]\",L_Propane_to_kgGES,Conversion!$H$37)+O18*IF(U_Bois20=\"[1000 kg MG]\",Conversion!$H$38,Conversion!$H$39)+Q18*IF(U_Bois45=\"[1000 kg MG]\",Conversion!$H$40,Conversion!$H$41)+S18*lbs_vapeur_to_kgGES+U18*MBTU_eaurefroidie_to_kgGES+W18*MBTU_eauchaude_to_kgGES)/1000","v":0},0,731,{"$f":"SUM(AE9:AE17)","v":2152.2999999999997},3]
["2020-02-01",null,null,null,null,null,null,null,null,null,null,null,null,null,null,null,null,null,null,null,null,null,null,null,0,0,"","",{"$f":"(C19*kWh_Élect_to_kgGES+E19*IF(U_GNat=\"[m³]\",m3_GazNat_to_kgGES,Conversion!$H$29)+G19*IF(U_Ma2=\"[l]\",L_Mazout2_to_kgGES,Conversion!$H$31)+I19*IF(U_Ma6=\"[l]\",L_Mazout6_to_kgGES,Conversion!$H$33)+K19*IF(U_Ma2=\"[l]\",L_Mazout2_to_kgGES,Conversion!$H$35)+M19*IF(U_Prop=\"[l]\",L_Propane_to_kgGES,Conversion!$H$37)+O19*IF(U_Bois20=\"[1000 kg MG]\",Conversion!$H$38,Conversion!$H$39)+Q19*IF(U_Bois45=\"[1000 kg MG]\",Conversion!$H$40,Conversion!$H$41)+S19*lbs_vapeur_to_kgGES+U19*MBTU_eaurefroidie_to_kgGES+W19*MBTU_eauchaude_to_kgGES)/1000","v":0},0,693.5,{"$f":"SUM(AE9:AE18)","v":2883.2999999999997},2]
["2020-03-01",null,null,null,null,null,null,null,null,null,null,null,null,null,null,null,null,null,null,null,null,null,null,null,0,0,"","",{"$f":"(C20*kWh_Élect_to_kgGES+E20*IF(U_GNat=\"[m³]\",m3_GazNat_to_kgGES,Conversion!$H$29)+G20*IF(U_Ma2=\"[l]\",L_Mazout2_to_kgGES,Conversion!$H$31)+I20*IF(U_Ma6=\"[l]\",L_Mazout6_to_kgGES,Conversion!$H$33)+K20*IF(U_Ma2=\"[l]\",L_Mazout2_to_kgGES,Conversion!$H$35)+M20*IF(U_Prop=\"[l]\",L_Propane_to_kgGES,Conversion!$H$37)+O20*IF(U_Bois20=\"[1000 kg MG]\",Conversion!$H$38,Conversion!$H$39)+Q20*IF(U_Bois45=\"[1000 kg MG]\",Conversion!$H$40,Conversion!$H$41)+S20*lbs_vapeur_to_kgGES+U20*MBTU_eaurefroidie_to_kgGES+W20*MBTU_eauchaude_to_kgGES)/1000","v":0},0,528.9,{"$f":"SUM(AE9:AE19)","v":3576.7999999999997},1]
["TOTAL/moyenne",{"$f":"IF(ISERROR(AVERAGE(B9:B20)),0,AVERAGE(B9:B20))","v":0},{"$f":"SUM(C9:C20)","v":0},{"$f":"SUM(D9:D20)","v":0},{"$f":"SUM(E9:E20)","v":0},{"$f":"SUM(F9:F20)","v":0},0,0,0,0,0,0,0,0,0,0,0,0,0,0,0,0,0,0,{"$f":"C21*kWh_Élect_to_GJ+E21*m3_GazNat_to_GJ+G21*L_Mazout2_to_GJ+I21*L_Mazout6_to_GJ+M21*L_Propane_to_GJ+O21*kg_Bois8_to_GJ+Q21*kg_Bois35_to_GJ+S21*lbs_vapeur_to_GJ+U21*MBTU_eaurefroidie_to_GJ+W21*MBTU_eauchaude_to_GJ+K21*L_Mazout2_to_GJ","v":0},{"$f":"D21+F21+H21+J21+L21+N21+P21+R21+T21+V21+X21","v":0},"","",{"$f":"(C21*kWh_Élect_to_kgGES+E21*IF(U_GNat=\"[m³]\",m3_GazNat_to_kgGES,Conversion!$H$29)+G21*IF(U_Ma2=\"[l]\",L_Mazout2_to_kgGES,Conversion!$H$31)+I21*IF(U_Ma6=\"[l]\",L_Mazout6_to_kgGES,Conversion!$H$33)+K21*IF(U_Ma2=\"[l]\",L_Mazout2_to_kgGES,Conversion!$H$35)+M21*IF(U_Prop=\"[l]\",L_Propane_to_kgGES,Conversion!$H$37)+O21*IF(U_Bois20=\"[1000 kg MG]\",Conversion!$H$38,Conversion!$H$39)+Q21*IF(U_Bois45=\"[1000 kg MG]\",Conversion!$H$40,Conversion!$H$41)+S21*lbs_vapeur_to_kgGES+U21*MBTU_eaurefroidie_to_kgGES+W21*MBTU_eauchaude_to_kgGES)/1000","v":0},0,{"$f":"SUM(AE9:AE20)","v":4105.7}]
[2019,"Sup_19-20","Elec_kWh_19-20","Elec_CAD_19-20","GN_m³_19-20","GN_CAD_19-20","Ma2_l_19-20","Ma2_CAD_19-20","Ma6_l_19-20","Ma6_CAD_19-20","Prop_l_19-20","Prop_CAD_19-20","Bois20_1000kg_19-20","Bois20_CAD_19-20","Bois45_1000kg_19-20","Bois45_CAD_19-20",null,null,null,null,null,null,"GJ_Tot_19-20","CAD_Tot_19-20","GJm²_19-20","CAD/m²_19-20","GES_ton_19-20","GES_ton/m²_19-20","DJC_tot_19-20"]
["Nombre de bâtiments en propriété ou location, pour lesquels des factures d'énergie sont payées par l'organisation :"]
[]
["ATTENTION, la saisie des consommations d'énergie comporte une erreur si la cellule AA21 est ombragée d'une couleur !",null,null,null,null,null,null,null,null,null,null,null,null,null,null,null,null,null,null,null,null,null,null,null,{"$f":"Lim_bas","v":0},{"$f":"Lim_haut","v":0}]
[]
["QUESTIONS SPÉCIFIQUES (cocher si applicable)"]
[]
["1."]
["2."]
["3."]
["4."]
["5."]
[]
["AJUSTEMENTS NON PÉRIODIQUE",null,"Un ajustement correspond à une modification majeure des équipements ou du bâtiment. Un ajustement peut avoir un impact positif ou négatif sur la consommation énergétique: \n    - un impact positif correspond à une augmentation majeure de la consommation, suite par exemple à l'ajout d'un étage de bâtiment ou à l'ajout de climatisation d'une aile d'un bâtiment.\n    - un impact négatif correspond à une diminution majeure de la consommation. Cette diminution provient non pas d’une économie provenant d’une optimisation du bâtiment mais par exemple de la fermeture d’une partie d'un bâtiment qui devient alors inoccupé.                                                                                                                                                                                                                                                 \nPar exemple : l'ajout de locaux implique une augmentation nette des charges de chauffage et d'éclairage de 500 kWh, telles que calculées par une firme d'ingénieurs. Dans ce fichier, le projet sera noté « Agrandissement » impliquant une augmentation de l'électricité de 500 kWh. Comme il s'agit de chauffage, l'ajustement est sensible au chauffage. La date d'implantation correspond au mois où l'impact sur la consommation a été effectif.\nSi l'ajustement a eu un impact sur plus qu'une source d'énergie, merci de rajouter une ligne pour chaque source touchée.\n"]
[]
[null,"Projet","Tendance de l'impact","Source d'énergie touchée","Impact Annuel",null,"Ajustement sensible au chauffage","Date d'implantation","Impact pour l'année complète [GJ]","Impact pour l'année en cours [GJ]",null,null,null,null,null,null,null,null,null,null,null,null,null,"Énergie de l'année de référence ajustée",{"$f":"((1-Facteur_variable)+Facteur_variable*DJC_tot_19_20/DJC_tot_09_10)*GJ_Tot_09_10+GJ_Ajust_NP_Cour_19_20","v":0},"GJTotRef_Ajust_19_20"]
[null,"Nom du projet #1",null,null,null,{"$f":"IF(D38=\"électrique\",\"kWh\",IF(D38=\"Gaz naturel\",\"m³\",IF(LEFT(D38,1)=\"R\",\"1000 kg\",\"l\")))","v":"l"},null,null,{"$f":"IF(COUNTA(G38)=1,IF(C38=\"Réduction\",-1,IF(C38=\"Augmentation\",1,0))*E38*INDEX(Conversion!$A$26:$J$42,MATCH(D38,Conversion!$J$26:$J$42,0),9),0)","v":0},{"$f":"IF(G38=\"Non\",I38*L38,IF(G38=\"Oui\",I38*K38,0))","v":0},{"$f":"(DJC_tot_19_20-INDEX($A$9:$AF$20,MATCH(H38,$A$9:$A$20,0),24))/DJC_tot_19_20","v":{"$error":"#N/A"}},{"$f":"INDEX($A$9:$AG$20,MATCH(H38,$A$9:$A$20,0),25)/12","v":{"$error":"#N/A"}},null,null,null,null,null,null,null,null,null,null,null,"Énergie de l'année de suivi",{"$f":"GJ_Tot_19_20","v":0}]
[null,"Nom du projet #2",null,null,null,{"$f":"IF(D39=\"électrique\",\"kWh\",IF(D39=\"Gaz naturel\",\"m³\",IF(LEFT(D39,1)=\"R\",\"1000 kg\",\"l\")))","v":"l"},null,null,{"$f":"IF(COUNTA(G39)=1,IF(C39=\"Réduction\",-1,IF(C39=\"Augmentation\",1,0))*E39*INDEX(Conversion!$A$26:$J$42,MATCH(D39,Conversion!$J$26:$J$42,0),9),0)","v":0},0,{"$error":"#N/A"},{"$error":"#N/A"},null,null,null,null,null,null,null,null,null,null,null,"Superficie de l'année de référence",{"$f":"Sup_09_10","v":0}]
[null,"Nom du projet #3",null,null,null,"l",null,null,{"$f":"IF(COUNTA(G40)=1,IF(C40=\"Réduction\",-1,IF(C40=\"Augmentation\",1,0))*E40*INDEX(Conversion!$A$26:$J$42,MATCH(D40,Conversion!$J$26:$J$42,0),9),0)","v":0},0,{"$error":"#N/A"},{"$error":"#N/A"},null,null,null,null,null,null,null,null,null,null,null,"Superficie de l'année de suivi",{"$f":"Sup_19_20","v":0}]
[null,"Nom du projet #4",null,null,null,"l",null,null,{"$f":"IF(COUNTA(G41)=1,IF(C41=\"Réduction\",-1,IF(C41=\"Augmentation\",1,0))*E41*INDEX(Conversion!$A$26:$J$42,MATCH(D41,Conversion!$J$26:$J$42,0),9),0)","v":0},0,{"$error":"#N/A"},{"$error":"#N/A"},null,null,null,null,null,null,null,null,null,null,null,null,{"$f":"GJTotRef_Ajust_19_20/Sup_09_10","v":{"$error":"#DIV/0!"}},"GJTotRef_Ajust_m²_19_20"]
[null,"Nom du projet #5",null,null,null,"l",null,null,{"$f":"IF(COUNTA(G42)=1,IF(C42=\"Réduction\",-1,IF(C42=\"Augmentation\",1,0))*E42*INDEX(Conversion!$A$26:$J$42,MATCH(D42,Conversion!$J$26:$J$42,0),9),0)","v":0},0,{"$error":"#N/A"},{"$error":"#N/A"},null,null,null,null,null,null,null,null,null,null,null,null,{"$f":"J45","v":0},"GJ_Ajust_NP_Cour_19_20"]
[null,"Nom du projet #6",null,null,null,"l",null,null,{"$f":"IF(COUNTA(G43)=1,IF(C43=\"Réduction\",-1,IF(C43=\"Augmentation\",1,0))*E43*INDEX(Conversion!$A$26:$J$42,MATCH(D43,Conversion!$J$26:$J$42,0),9),0)","v":0},0,{"$error":"#N/A"},{"$error":"#N/A"},null,null,null,null,null,null,null,null,null,null,null,null,{"$f":"I45","v":0},"GJ_Ajust_NP_annuel_19_20"]
[null,"Nom du projet #7",null,null,null,"l",null,null,{"$f":"IF(COUNTA(G44)=1,IF(C44=\"Réduction\",-1,IF(C44=\"Augmentation\",1,0))*E44*INDEX(Conversion!$A$26:$J$42,MATCH(D44,Conversion!$J$26:$J$42,0),9),0)","v":0},0,{"$error":"#N/A"},{"$error":"#N/A"}]
[null,"TOTAL",null,null,null,null,null,null,{"$f":"SUM(I38:I44)","v":0},{"$f":"SUM(J38:J44)","v":0}]
[]
[]
[]
[]
[]
[]
[]
[]
[null,null,"Réduction","Électrique",null,null,"Oui"]
[null,null,"Augmentation","Gaz naturel",null,null,"Non"]
[null,null,null,"Mazout n°2"]
[null,null,null,"Mazout n°6"]
[null,null,null,"Propane"]
[null,null,null,"Résidus de bois (20%humidité)"]
[null,null,null,"Résidus de bois (45%humidité)"]
[null,null,null,"-"]

{"sheet":"2020-2021","index":13,"n_rows":61,"n_cols":33,"rows_kept":61,"cut":false,"hidden":true,"merged":[[6,12,6,13],[34,0,34,1],[34,2,34,11],[6,0,7,0],[6,2,6,3],[6,4,6,5],[6,10,6,11],[24,0,24,7],[6,6,6,7],[6,8,6,9],[6,18,6,19],[6,20,6,21],[6,26,6,27],[6,28,6,29],[6,14,6,15],[6,22,6,23],[6,16,6,17],[6,24,6,25]]}
[]
[null,null,null,"Saisir les données énergétiques et les données sur les dépenses annuelles, avant taxes, dans les cellules ombragées en bleu pâle."]
[null,null,null,"Pour les fins du BEIE, la saisie mensuelle des données est optionnelle. Les espaces pour saisir mensuellement les données sont mises à la disposition des MO afin de leur permettre de suivre périodiquement la consommation."]
[null,null,null,"Dans le cas où un projet ayant un effet sur la consommation énergétique a eu lieu au cours de l'année (rénovation, agrandissement, etc.), "]
[null,null,null,"veuillez remplir la section « AJUSTEMENTS NON PÉRIODIQUES », ci-dessous."]
[]
["<-- Résumé","Superficie","Consommation électrique",null,"Gaz naturel",null,"Mazout n°2 ",null,"Mazout n°6",null,"Diesel (génératrice)",null,"Propane",null,"Résidus de bois\n (20% d'humidité)",null,"Résidus de bois\n(45% d'humidité)",null,"Vapeur",null,"Eau refroidie",null,"Eau chaude",null,"TOTAL",null,"Intensité Énergétique",null,"GES",null,"DJC"]
[null,"[m²]","[kWh]","[$]","[m³]","[$]","[l]","[$]","[l]","[$]","[l]","[$]","[l]","[$]","[1000 kg MG]","[$]","[1000 kg MG]","[$]","[lbs]","[$]","[MBTU]","[$]","[MBTU]","[$]"," [GJ]","[$]","[GJ/m²]","[$/m²]","[Ton CO2 eq]","[kg CO2 eq/m²]"," [° C]"]
[{"$f":"VALUE(CONCATENATE(LEFT(Annee_financiere,FIND(\"-\",Annee_financiere)-1),\"-\",A22))","v":"2020-04-01"},null,null,null,null,null,null,null,null,null,null,null,null,null,null,null,null,null,null,null,null,null,null,null,{"$f":"C9*kWh_Élect_to_GJ+E9*m3_GazNat_to_GJ+G9*L_Mazout2_to_GJ+I9*L_Mazout6_to_GJ+M9*L_Propane_to_GJ+O9*kg_Bois8_to_GJ+Q9*kg_Bois35_to_GJ+S9*lbs_vapeur_to_GJ+U9*MBTU_eaurefroidie_to_GJ+W9*MBTU_eauchaude_to_GJ+K9*L_Diesel_to_GJ","v":0},{"$f":"D9+F9+H9+J9+N9+P9+R9+T9+V9+X9+L9","v":0},{"$f":"IF(ISERROR(Y9/B9),\"\",Y9/B9)","v":""},{"$f":"IF(ISERROR(Z9/B9),\"\",Z9/B9)","v":""},{"$f":"(C9*kWh_Élect_to_kgGES+E9*IF(U_GNat=\"[m³]\",m3_GazNat_to_kgGES,Conversion!$H$29)+G9*IF(U_Ma2=\"[l]\",L_Mazout2_to_kgGES,Conversion!$H$31)+I9*IF(U_Ma6=\"[l]\",L_Mazout6_to_kgGES,Conversion!$H$33)+K9*IF(U_Dies=\"[l]\",L_diesel_to_kgGES,Conversion!$H$35)+M9*IF(U_Prop=\"[l]\",L_Propane_to_kgGES,Conversion!$H$37)+O9*IF(U_Bois20=\"[1000 kg MG]\",Conversion!$H$38,Conversion!$H$39)+Q9*IF(U_Bois45=\"[1000 kg MG]\",Conversion!$H$40,Conversion!$H$41)+S9*lbs_vapeur_to_kgGES+U9*MBTU_eaurefroidie_to_kgGES+W9*MBTU_eauchaude_to_kgGES)/1000","v":{"$error":"#NAME?"}},{"$f":"(IF(ISERROR(AC9/B9),0,(AC9/B9)))*1000","v":0},{"$f":"INDEX(plage_DJ,MATCH(A9,plage_date),3)","v":382.5},null,12]
[{"$f":"DATE(YEAR(A9),MONTH(A9)+1,DAY(A9))","v":"2020-05-01"},null,null,null,null,null,null,null,null,null,null,null,null,null,null,null,null,null,null,null,null,null,null,null,0,{"$f":"D10+F10+H10+J10+N10+P10+R10+T10+V10+X10+L10","v":0},"","",{"$f":"(C10*kWh_Élect_to_kgGES+E10*IF(U_GNat=\"[m³]\",m3_GazNat_to_kgGES,Conversion!$H$29)+G10*IF(U_Ma2=\"[l]\",L_Mazout2_to_kgGES,Conversion!$H$31)+I10*IF(U_Ma6=\"[l]\",L_Mazout6_to_kgGES,Conversion!$H$33)+K10*IF(U_Dies=\"[l]\",L_diesel_to_kgGES,Conversion!$H$35)+M10*IF(U_Prop=\"[l]\",L_Propane_to_kgGES,Conversion!$H$37)+O10*IF(U_Bois20=\"[1000 kg MG]\",Conversion!$H$38,Conversion!$H$39)+Q10*IF(U_Bois45=\"[1000 kg MG]\",Conversion!$H$40,Conversion!$H$41)+S10*lbs_vapeur_to_kgGES+U10*MBTU_eaurefroidie_to_kgGES+W10*MBTU_eauchaude_to_kgGES)/1000","v":{"$error":"#NAME?"}},0,176.7,{"$f":"SUM(AE9)","v":382.5},11]
[{"$f":"DATE(YEAR(A10),MONTH(A10)+1,DAY(A10))","v":"2020-06-01"},null,null,null,null,null,null,null,null,null,null,null,null,null,null,null,null,null,null,null,null,null,null,null,0,0,"","",{"$f":"(C11*kWh_Élect_to_kgGES+E11*IF(U_GNat=\"[m³]\",m3_GazNat_to_kgGES,Conversion!$H$29)+G11*IF(U_Ma2=\"[l]\",L_Mazout2_to_kgGES,Conversion!$H$31)+I11*IF(U_Ma6=\"[l]\",L_Mazout6_to_kgGES,Conversion!$H$33)+K11*IF(U_Dies=\"[l]\",L_diesel_to_kgGES,Conversion!$H$35)+M11*IF(U_Prop=\"[l]\",L_Propane_to_kgGES,Conversion!$H$37)+O11*IF(U_Bois20=\"[1000 kg MG]\",Conversion!$H$38,Conversion!$H$39)+Q11*IF(U_Bois45=\"[1000 kg MG]\",Conversion!$H$40,Conversion!$H$41)+S11*lbs_vapeur_to_kgGES+U11*MBTU_eaurefroidie_to_kgGES+W11*MBTU_eauchaude_to_kgGES)/1000","v":{"$error":"#NAME?"}},0,36.9,{"$f":"SUM(AE9:AE10)","v":559.20000000000005},10]
["2020-07-01",null,null,null,null,null,null,null,null,null,null,null,null,null,null,null,null,null,null,null,null,null,null,null,0,0,"","",{"$f":"(C12*kWh_Élect_to_kgGES+E12*IF(U_GNat=\"[m³]\",m3_GazNat_to_kgGES,Conversion!$H$29)+G12*IF(U_Ma2=\"[l]\",L_Mazout2_to_kgGES,Conversion!$H$31)+I12*IF(U_Ma6=\"[l]\",L_Mazout6_to_kgGES,Conversion!$H$33)+K12*IF(U_Dies=\"[l]\",L_diesel_to_kgGES,Conversion!$H$35)+M12*IF(U_Prop=\"[l]\",L_Propane_to_kgGES,Conversion!$H$37)+O12*IF(U_Bois20=\"[1000 kg MG]\",Conversion!$H$38,Conversion!$H$39)+Q12*IF(U_Bois45=\"[1000 kg MG]\",Conversion!$H$40,Conversion!$H$41)+S12*lbs_vapeur_to_kgGES+U12*MBTU_eaurefroidie_to_kgGES+W12*MBTU_eauchaude_to_kgGES)/1000","v":{"$error":"#NAME?"}},0,0,{"$f":"SUM(AE9:AE11)","v":596.1},9]
["2020-08-01",null,null,null,null,null,null,null,null,null,null,null,null,null,null,null,null,null,null,null,null,null,null,null,0,0,"","",{"$f":"(C13*kWh_Élect_to_kgGES+E13*IF(U_GNat=\"[m³]\",m3_GazNat_to_kgGES,Conversion!$H$29)+G13*IF(U_Ma2=\"[l]\",L_Mazout2_to_kgGES,Conversion!$H$31)+I13*IF(U_Ma6=\"[l]\",L_Mazout6_to_kgGES,Conversion!$H$33)+K13*IF(U_Dies=\"[l]\",L_diesel_to_kgGES,Conversion!$H$35)+M13*IF(U_Prop=\"[l]\",L_Propane_to_kgGES,Conversion!$H$37)+O13*IF(U_Bois20=\"[1000 kg MG]\",Conversion!$H$38,Conversion!$H$39)+Q13*IF(U_Bois45=\"[1000 kg MG]\",Conversion!$H$40,Conversion!$H$41)+S13*lbs_vapeur_to_kgGES+U13*MBTU_eaurefroidie_to_kgGES+W13*MBTU_eauchaude_to_kgGES)/1000","v":{"$error":"#NAME?"}},0,17.5,{"$f":"SUM(AE9:AE12)","v":596.1},8]
["2020-09-01",null,null,null,null,null,null,null,null,null,null,null,null,null,null,null,null,null,null,null,null,null,null,null,0,0,"","",{"$f":"(C14*kWh_Élect_to_kgGES+E14*IF(U_GNat=\"[m³]\",m3_GazNat_to_kgGES,Conversion!$H$29)+G14*IF(U_Ma2=\"[l]\",L_Mazout2_to_kgGES,Conversion!$H$31)+I14*IF(U_Ma6=\"[l]\",L_Mazout6_to_kgGES,Conversion!$H$33)+K14*IF(U_Dies=\"[l]\",L_diesel_to_kgGES,Conversion!$H$35)+M14*IF(U_Prop=\"[l]\",L_Propane_to_kgGES,Conversion!$H$37)+O14*IF(U_Bois20=\"[1000 kg MG]\",Conversion!$H$38,Conversion!$H$39)+Q14*IF(U_Bois45=\"[1000 kg MG]\",Conversion!$H$40,Conversion!$H$41)+S14*lbs_vapeur_to_kgGES+U14*MBTU_eaurefroidie_to_kgGES+W14*MBTU_eauchaude_to_kgGES)/1000","v":{"$error":"#NAME?"}},0,100.2,{"$f":"SUM(AE9:AE13)","v":613.6},7]
["2020-10-01",null,null,null,null,null,null,null,null,null,null,null,null,null,null,null,null,null,null,null,null,null,null,null,0,0,"","",{"$f":"(C15*kWh_Élect_to_kgGES+E15*IF(U_GNat=\"[m³]\",m3_GazNat_to_kgGES,Conversion!$H$29)+G15*IF(U_Ma2=\"[l]\",L_Mazout2_to_kgGES,Conversion!$H$31)+I15*IF(U_Ma6=\"[l]\",L_Mazout6_to_kgGES,Conversion!$H$33)+K15*IF(U_Dies=\"[l]\",L_diesel_to_kgGES,Conversion!$H$35)+M15*IF(U_Prop=\"[l]\",L_Propane_to_kgGES,Conversion!$H$37)+O15*IF(U_Bois20=\"[1000 kg MG]\",Conversion!$H$38,Conversion!$H$39)+Q15*IF(U_Bois45=\"[1000 kg MG]\",Conversion!$H$40,Conversion!$H$41)+S15*lbs_vapeur_to_kgGES+U15*MBTU_eaurefroidie_to_kgGES+W15*MBTU_eauchaude_to_kgGES)/1000","v":{"$error":"#NAME?"}},0,284.60000000000002,{"$f":"SUM(AE9:AE14)","v":713.80000000000007},6]
["2020-11-01",null,null,null,null,null,null,null,null,null,null,null,null,null,null,null,null,null,null,null,null,null,null,null,0,0,"","",{"$f":"(C16*kWh_Élect_to_kgGES+E16*IF(U_GNat=\"[m³]\",m3_GazNat_to_kgGES,Conversion!$H$29)+G16*IF(U_Ma2=\"[l]\",L_Mazout2_to_kgGES,Conversion!$H$31)+I16*IF(U_Ma6=\"[l]\",L_Mazout6_to_kgGES,Conversion!$H$33)+K16*IF(U_Dies=\"[l]\",L_diesel_to_kgGES,Conversion!$H$35)+M16*IF(U_Prop=\"[l]\",L_Propane_to_kgGES,Conversion!$H$37)+O16*IF(U_Bois20=\"[1000 kg MG]\",Conversion!$H$38,Conversion!$H$39)+Q16*IF(U_Bois45=\"[1000 kg MG]\",Conversion!$H$40,Conversion!$H$41)+S16*lbs_vapeur_to_kgGES+U16*MBTU_eaurefroidie_to_kgGES+W16*MBTU_eauchaude_to_kgGES)/1000","v":{"$error":"#NAME?"}},0,0,{"$f":"SUM(AE9:AE15)","v":998.40000000000009},5]
["2020-12-01",null,null,null,null,null,null,null,null,null,null,null,null,null,null,null,null,null,null,null,null,null,null,null,0,0,"","",{"$f":"(C17*kWh_Élect_to_kgGES+E17*IF(U_GNat=\"[m³]\",m3_GazNat_to_kgGES,Conversion!$H$29)+G17*IF(U_Ma2=\"[l]\",L_Mazout2_to_kgGES,Conversion!$H$31)+I17*IF(U_Ma6=\"[l]\",L_Mazout6_to_kgGES,Conversion!$H$33)+K17*IF(U_Dies=\"[l]\",L_diesel_to_kgGES,Conversion!$H$35)+M17*IF(U_Prop=\"[l]\",L_Propane_to_kgGES,Conversion!$H$37)+O17*IF(U_Bois20=\"[1000 kg MG]\",Conversion!$H$38,Conversion!$H$39)+Q17*IF(U_Bois45=\"[1000 kg MG]\",Conversion!$H$40,Conversion!$H$41)+S17*lbs_vapeur_to_kgGES+U17*MBTU_eaurefroidie_to_kgGES+W17*MBTU_eauchaude_to_kgGES)/1000","v":{"$error":"#NAME?"}},0,0,{"$f":"SUM(AE9:AE16)","v":998.40000000000009},4]
["2021-01-01",null,null,null,null,null,null,null,null,null,null,null,null,null,null,null,null,null,null,null,null,null,null,null,0,0,"","",{"$f":"(C18*kWh_Élect_to_kgGES+E18*IF(U_GNat=\"[m³]\",m3_GazNat_to_kgGES,Conversion!$H$29)+G18*IF(U_Ma2=\"[l]\",L_Mazout2_to_kgGES,Conversion!$H$31)+I18*IF(U_Ma6=\"[l]\",L_Mazout6_to_kgGES,Conversion!$H$33)+K18*IF(U_Dies=\"[l]\",L_diesel_to_kgGES,Conversion!$H$35)+M18*IF(U_Prop=\"[l]\",L_Propane_to_kgGES,Conversion!$H$37)+O18*IF(U_Bois20=\"[1000 kg MG]\",Conversion!$H$38,Conversion!$H$39)+Q18*IF(U_Bois45=\"[1000 kg MG]\",Conversion!$H$40,Conversion!$H$41)+S18*lbs_vapeur_to_kgGES+U18*MBTU_eaurefroidie_to_kgGES+W18*MBTU_eauchaude_to_kgGES)/1000","v":{"$error":"#NAME?"}},0,0,{"$f":"SUM(AE9:AE17)","v":998.40000000000009},3]
["2021-02-01",null,null,null,null,null,null,null,null,null,null,null,null,null,null,null,null,null,null,null,null,null,null,null,0,0,"","",{"$f":"(C19*kWh_Élect_to_kgGES+E19*IF(U_GNat=\"[m³]\",m3_GazNat_to_kgGES,Conversion!$H$29)+G19*IF(U_Ma2=\"[l]\",L_Mazout2_to_kgGES,Conversion!$H$31)+I19*IF(U_Ma6=\"[l]\",L_Mazout6_to_kgGES,Conversion!$H$33)+K19*IF(U_Dies=\"[l]\",L_diesel_to_kgGES,Conversion!$H$35)+M19*IF(U_Prop=\"[l]\",L_Propane_to_kgGES,Conversion!$H$37)+O19*IF(U_Bois20=\"[1000 kg MG]\",Conversion!$H$38,Conversion!$H$39)+Q19*IF(U_Bois45=\"[1000 kg MG]\",Conversion!$H$40,Conversion!$H$41)+S19*lbs_vapeur_to_kgGES+U19*MBTU_eaurefroidie_to_kgGES+W19*MBTU_eauchaude_to_kgGES)/1000","v":{"$error":"#NAME?"}},0,0,{"$f":"SUM(AE9:AE18)","v":998.40000000000009},2]
["2021-03-01",null,null,null,null,null,null,null,null,null,null,null,null,null,null,null,null,null,null,null,null,null,null,null,0,0,"","",{"$f":"(C20*kWh_Élect_to_kgGES+E20*IF(U_GNat=\"[m³]\",m3_GazNat_to_kgGES,Conversion!$H$29)+G20*IF(U_Ma2=\"[l]\",L_Mazout2_to_kgGES,Conversion!$H$31)+I20*IF(U_Ma6=\"[l]\",L_Mazout6_to_kgGES,Conversion!$H$33)+K20*IF(U_Dies=\"[l]\",L_diesel_to_kgGES,Conversion!$H$35)+M20*IF(U_Prop=\"[l]\",L_Propane_to_kgGES,Conversion!$H$37)+O20*IF(U_Bois20=\"[1000 kg MG]\",Conversion!$H$38,Conversion!$H$39)+Q20*IF(U_Bois45=\"[1000 kg MG]\",Conversion!$H$40,Conversion!$H$41)+S20*lbs_vapeur_to_kgGES+U20*MBTU_eaurefroidie_to_kgGES+W20*MBTU_eauchaude_to_kgGES)/1000","v":{"$error":"#NAME?"}},0,0,{"$f":"SUM(AE9:AE19)","v":998.40000000000009},1]
["TOTAL/moyenne",{"$f":"IF(ISERROR(AVERAGE(B9:B20)),0,AVERAGE(B9:B20))","v":0},{"$f":"SUM(C9:C20)","v":0},{"$f":"SUM(D9:D20)","v":0},{"$f":"SUM(E9:E20)","v":0},{"$f":"SUM(F9:F20)","v":0},0,0,0,0,0,0,0,0,0,0,0,0,0,0,0,0,0,0,0,0,"","",{"$f":"(C21*kWh_Élect_to_kgGES+E21*IF(U_GNat=\"[m³]\",m3_GazNat_to_kgGES,Conversion!$H$29)+G21*IF(U_Ma2=\"[l]\",L_Mazout2_to_kgGES,Conversion!$H$31)+I21*IF(U_Ma6=\"[l]\",L_Mazout6_to_kgGES,Conversion!$H$33)+K21*IF(U_Dies=\"[l]\",L_diesel_to_kgGES,Conversion!$H$35)+M21*IF(U_Prop=\"[l]\",L_Propane_to_kgGES,Conversion!$H$37)+O21*IF(U_Bois20=\"[1000 kg MG]\",Conversion!$H$38,Conversion!$H$39)+Q21*IF(U_Bois45=\"[1000 kg MG]\",Conversion!$H$40,Conversion!$H$41)+S21*lbs_vapeur_to_kgGES+U21*MBTU_eaurefroidie_to_kgGES+W21*MBTU_eauchaude_to_kgGES)/1000","v":{"$error":"#NAME?"}},0,{"$f":"SUM(AE9:AE20)","v":998.40000000000009}]
[2020,"Sup_20-21","Elec_kWh_20-21","Elec_CAD_20-21","GN_m³_20-21","GN_CAD_20-21","Ma2_l_20-21","Ma2_CAD_20-21","Ma6_l_20-21","Ma6_CAD_20-21","Prop_l_20-21","Prop_CAD_20-21","Bois20_1000kg_20-21","Bois20_CAD_20-21","Bois45_1000kg_20-21","Bois45_CAD_20-21",null,null,null,null,null,null,"GJ_Tot_20-21","CAD_Tot_20-21","GJm²_20-21","CAD/m²_20-21","GES_ton_20-21","GES_ton/m²_20-21","DJC_tot_20-21"]
["Nombre de bâtiments en propriété ou location, pour lesquels des factures d'énergie sont payées par l'organisation :"]
[]
["ATTENTION, la saisie des consommations d'énergie comporte une erreur si la cellule AA21 est ombragée d'une couleur !",null,null,null,null,null,null,null,null,null,null,null,null,null,null,null,null,null,null,null,null,null,null,null,{"$f":"Lim_bas","v":0},{"$f":"Lim_haut","v":0}]
[]
["QUESTIONS SPÉCIFIQUES (cocher si applicable)"]
[]
["1."]
["2."]
["3."]
["4."]
["5."]
[]
["AJUSTEMENTS NON PÉRIODIQUE",null,"Un ajustement correspond à une modification majeure des équipements ou du bâtiment. Un ajustement peut avoir un impact positif ou négatif sur la consommation énergétique: \n    - un impact positif correspond à une augmentation majeure de la consommation, suite par exemple à l'ajout d'un étage de bâtiment ou à l'ajout de climatisation d'une aile d'un bâtiment.\n    - un impact négatif correspond à une diminution majeure de la consommation. Cette diminution provient non pas d’une économie provenant d’une optimisation du bâtiment mais par exemple de la fermeture d’une partie d'un bâtiment qui devient alors inoccupé.                                                                                                                                                                                                                                                 \nPar exemple : l'ajout de locaux implique une augmentation nette des charges de chauffage et d'éclairage de 500 kWh, telles que calculées par une firme d'ingénieurs. Dans ce fichier, le projet sera noté « Agrandissement » impliquant une augmentation de l'électricité de 500 kWh. Comme il s'agit de chauffage, l'ajustement est sensible au chauffage. La date d'implantation correspond au mois où l'impact sur la consommation a été effectif.\nSi l'ajustement a eu un impact sur plus qu'une source d'énergie, merci de rajouter une ligne pour chaque source touchée.\n"]
[]
[null,"Projet","Tendance de l'impact","Source d'énergie touchée","Impact Annuel",null,"Ajustement sensible au chauffage","Date d'implantation","Impact pour l'année complète [GJ]","Impact pour l'année en cours [GJ]",null,null,null,null,null,null,null,null,null,null,null,null,null,"Énergie de l'année de référence ajustée",{"$f":"((1-Facteur_variable)+Facteur_variable*DJC_tot_20_21/DJC_tot_09_10)*GJ_Tot_09_10+GJ_Ajust_NP_Cour_20_21","v":0},"GJTotRef_Ajust_20_21"]
[null,"Nom du projet #1",null,null,null,{"$f":"IF(D38=\"électrique\",\"kWh\",IF(D38=\"Gaz naturel\",\"m³\",IF(LEFT(D38,1)=\"R\",\"1000 kg\",\"l\")))","v":"l"},null,null,{"$f":"IF(COUNTA(G38)=1,IF(C38=\"Réduction\",-1,IF(C38=\"Augmentation\",1,0))*E38*INDEX(Conversion!$A$26:$J$42,MATCH(D38,Conversion!$J$26:$J$42,0),9),0)","v":0},{"$f":"IF(G38=\"Non\",I38*L38,IF(G38=\"Oui\",I38*K38,0))","v":0},{"$f":"(DJC_tot_20_21-INDEX($A$9:$AF$20,MATCH(H38,$A$9:$A$20,0),24))/DJC_tot_20_21","v":{"$error":"#N/A"}},{"$f":"INDEX($A$9:$AG$20,MATCH(H38,$A$9:$A$20,0),25)/12","v":{"$error":"#N/A"}},null,null,null,null,null,null,null,null,null,null,null,"Énergie de l'année de suivi",{"$f":"GJ_Tot_20_21","v":0}]
[null,"Nom du projet #2",null,null,null,{"$f":"IF(D39=\"électrique\",\"kWh\",IF(D39=\"Gaz naturel\",\"m³\",IF(LEFT(D39,1)=\"R\",\"1000 kg\",\"l\")))","v":"l"},null,null,{"$f":"IF(COUNTA(G39)=1,IF(C39=\"Réduction\",-1,IF(C39=\"Augmentation\",1,0))*E39*INDEX(Conversion!$A$26:$J$42,MATCH(D39,Conversion!$J$26:$J$42,0),9),0)","v":0},0,{"$error":"#N/A"},{"$error":"#N/A"},null,null,null,null,null,null,null,null,null,null,null,"Superficie de l'année de référence",{"$f":"Sup_09_10","v":0}]
[null,"Nom du projet #3",null,null,null,"l",null,null,{"$f":"IF(COUNTA(G40)=1,IF(C40=\"Réduction\",-1,IF(C40=\"Augmentation\",1,0))*E40*INDEX(Conversion!$A$26:$J$42,MATCH(D40,Conversion!$J$26:$J$42,0),9),0)","v":0},0,{"$error":"#N/A"},{"$error":"#N/A"},null,null,null,null,null,null,null,null,null,null,null,"Superficie de l'année de suivi",{"$f":"Sup_20_21","v":0}]
[null,"Nom du projet #4",null,null,null,"l",null,null,{"$f":"IF(COUNTA(G41)=1,IF(C41=\"Réduction\",-1,IF(C41=\"Augmentation\",1,0))*E41*INDEX(Conversion!$A$26:$J$42,MATCH(D41,Conversion!$J$26:$J$42,0),9),0)","v":0},0,{"$error":"#N/A"},{"$error":"#N/A"},null,null,null,null,null,null,null,null,null,null,null,null,{"$f":"GJTotRef_Ajust_20_21/Sup_09_10","v":{"$error":"#DIV/0!"}},"GJTotRef_Ajust_m²_20_21"]
[null,"Nom du projet #5",null,null,null,"l",null,null,{"$f":"IF(COUNTA(G42)=1,IF(C42=\"Réduction\",-1,IF(C42=\"Augmentation\",1,0))*E42*INDEX(Conversion!$A$26:$J$42,MATCH(D42,Conversion!$J$26:$J$42,0),9),0)","v":0},0,{"$error":"#N/A"},{"$error":"#N/A"},null,null,null,null,null,null,null,null,null,null,null,null,{"$f":"J45","v":0},"GJ_Ajust_NP_Cour_20_21"]
[null,"Nom du projet #6",null,null,null,"l",null,null,{"$f":"IF(COUNTA(G43)=1,IF(C43=\"Réduction\",-1,IF(C43=\"Augmentation\",1,0))*E43*INDEX(Conversion!$A$26:$J$42,MATCH(D43,Conversion!$J$26:$J$42,0),9),0)","v":0},0,{"$error":"#N/A"},{"$error":"#N/A"},null,null,null,null,null,null,null,null,null,null,null,null,{"$f":"I45","v":0},"GJ_Ajust_NP_annuel_20_21"]
[null,"Nom du projet #7",null,null,null,"l",null,null,{"$f":"IF(COUNTA(G44)=1,IF(C44=\"Réduction\",-1,IF(C44=\"Augmentation\",1,0))*E44*INDEX(Conversion!$A$26:$J$42,MATCH(D44,Conversion!$J$26:$J$42,0),9),0)","v":0},0,{"$error":"#N/A"},{"$error":"#N/A"}]
[null,"TOTAL",null,null,null,null,null,null,{"$f":"SUM(I38:I44)","v":0},{"$f":"SUM(J38:J44)","v":0}]
[]
[]
[]
[]
[]
[]
[]
[]
[null,null,"Réduction","Électrique",null,null,"Oui"]
[null,null,"Augmentation","Gaz naturel",null,null,"Non"]
[null,null,null,"Mazout n°2"]
[null,null,null,"Mazout n°6"]
[null,null,null,"Propane"]
[null,null,null,"Résidus de bois (20%humidité)"]
[null,null,null,"Résidus de bois (45%humidité)"]
[null,null,null,"-"]

{"sheet":"DJ 18 MTL","index":14,"n_rows":248,"n_cols":11,"rows_kept":248,"cut":false,"hidden":true,"merged":[[2,8,3,8],[0,7,1,10],[2,1,3,1],[2,0,3,0],[0,0,1,3],[2,7,3,7]]}
["Degrés-jours calculés de Montréal (Pierre Elliot Trudeau)",null,null,null,null,null,null,"Degrés-jours calculés de Québec (Qc)"]
[]
["Début","Fin","DJC","DJR",null,null,null,"Début","Fin","DJC","DJR"]
[null,null,"° C","° C",null,null,null,null,null,"° C","° C"]
["Degrés-jours calculés de Montréal (Pierre Elliot Trudeau)",null,null,null,null,null,"Degrés-jours calculés de Québec (Qc)"]
[]
["Début","Fin","DJC","DJR",null,null,"Début","Fin","DJC","DJR"]
[null,null,"° C","° C",null,null,null,null,"° C","° C"]
["2002-01-01","2002-01-31",695.7,0,"Janvier",2002,null,"2002-01-31",{"$error":"#NAME?"},0]
["2002-02-01","2002-02-28",643.29999999999995,0,"Février",2002,37288,"2002-02-28","1902-01-19T04:48:00",0]
["2002-03-01","2002-03-31",616.20000000000005,0,"Mars",2002,37316,"2002-03-31","1901-12-12T04:48:00",0]
["2002-04-01","2002-04-30",336.6,3.2,"Avril",2002,37347,"2002-04-30","1901-03-02T04:48:00",0]
["2002-05-01","2002-05-31",214.4,6.6,"Mai",2002,37377,"2002-05-31","1900-09-29T14:24:00",1.4]
["2002-06-01","2002-06-30",53.3,38.1,"Juin",2002,37408,"2002-06-30","1900-04-16T02:24:00",13.8]
["2002-07-01","2002-07-31",2.9,130.19999999999999,"Juillet",2002,37438,"2002-07-31","1900-01-18T19:12:00",74.900000000000006]
["2002-08-01","2002-08-31",4.3,123.1,"Août",2002,37469,"2002-08-31","1900-01-23T09:36:00",66.599999999999994]
["2002-09-01","2002-09-30",51,60.1,"Septembre",2002,37500,"2002-09-30","1900-04-08T04:48:00",27.8]
["2002-10-01","2002-10-31",343.7,3.3,"Octobre",2002,37530,"2002-10-31","1901-02-14",0.5]
["2002-11-01","2002-11-30",517.1,0,"Novembre",2002,37561,"2002-11-30","1901-09-01T16:48:00",0]
["2002-12-01","2002-12-31",699.9,0,"Décembre",2002,37591,"2002-12-31","1902-03-07",0]
["2003-01-01","2003-01-31",948.3,0,"Janvier",2003,37622,"2003-01-31","1902-10-08T14:24:00",0]
["2003-02-01","2003-02-28",805.6,0,"Février",2003,37653,"2003-02-28","1902-05-25T12:00:00",0]
["2003-03-01","2003-03-31",674.9,0,"Mars",2003,37681,"2003-03-31","1902-01-16T16:48:00",0]
["2003-04-01","2003-04-30",413.1,0,"Avril",2003,37712,"2003-04-30","1901-05-20T02:24:00",0]
["2003-05-01","2003-05-31",144.80000000000001,3.4,"Mai",2003,37742,"2003-05-31","1900-08-12T16:48:00",2]
["2003-06-01","2003-06-30",39.9,64.099999999999994,"Juin",2003,37773,"2003-06-30","1900-03-11T14:24:00",43.9]
["2003-07-01","2003-07-31",0.8,112.6,"Juillet",2003,37803,"2003-07-31","1900-01-19",33.299999999999997]
["2003-08-01","2003-08-31",10.199999999999999,121.5,"Août",2003,37834,"2003-08-31","1900-02-15T07:12:00",48.6]
["2003-09-01","2003-09-30",43.2,33,"Septembre",2003,37865,"2003-09-30","1900-03-30T07:12:00",8.5]
["2003-10-01","2003-10-31",310.2,0,"Octobre",2003,37895,"2003-10-31","1900-12-23",0]
["2003-11-01","2003-11-30",453.7,0,"Novembre",2003,37926,"2003-11-30","1901-06-09T07:12:00",0]
["2003-12-01","2003-12-31",710.8,0,"Décembre",2003,37956,"2003-12-31","1902-01-26T04:48:00",0]
["2004-01-01","2004-01-31",1026.4000000000001,0,"Janvier",2004,37987,"2004-01-31","1902-12-20T21:36:00",0]
["2004-02-01","2004-02-29",750.8,0,"Février",2004,38018,"2004-02-29","1902-03-13T02:24:00",0]
["2004-03-01","2004-03-31",567.6,0,"Mars",2004,38047,"2004-03-31","1901-10-25T19:12:00",0]
["2004-04-01","2004-04-30",361.5,2.4,"Avril",2004,38078,"2004-04-30","1901-03-09T07:12:00",0]
["2004-05-01","2004-05-31",144.9,3.8,"Mai",2004,38108,"2004-05-31","1900-08-20T02:24:00",0]
["2004-06-01","2004-06-30",45.5,31.4,"Juin",2004,38139,"2004-06-30","1900-04-06T04:48:00",4]
["2004-07-01","2004-07-31",0.7,108.9,"Juillet",2004,38169,"2004-07-31","1900-01-07T21:36:00",55]
["2004-08-01","2004-08-31",18.399999999999999,59.2,"Août",2004,38200,"2004-08-31","1900-02-05T02:24:00",27.6]
["2004-09-01","2004-09-30",60.9,11.6,"Septembre",2004,38231,"2004-09-30","1900-05-09T14:24:00",1.8]
["2004-10-01","2004-10-31",281.8,0.5,"Octobre",2004,38261,"2004-10-31","1900-11-04T21:36:00",0]
["2004-11-01","2004-11-30",472.6,0,"Novembre",2004,38292,"2004-11-30","1901-07-02",0]
["2004-12-01","2004-12-31",787.5,0,"Décembre",2004,38322,"2004-12-31","1902-05-21T04:48:00",0]
["2005-01-01","2005-01-31",898.4,0,"Janvier",2005,38353,"2005-01-31","1902-10-01T02:24:00",0]
["2005-02-01","2005-02-28",686.7,0,"Février",2005,38384,"2005-02-28","1902-01-10T09:36:00",0]
["2005-03-01","2005-03-31",659.4,0,"Mars",2005,38412,"2005-03-31","1901-12-01T02:24:00",0]
["2005-04-01","2005-04-30",308.39999999999998,0,"Avril",2005,38443,"2005-04-30","1901-01-28T19:12:00",0]
["2005-05-01","2005-05-31",190.3,0.89999999999999858,"Mai",2005,38473,"2005-05-31","1900-08-23T07:12:00",0]
["2005-06-01","2005-06-30",16.2,121.3,"Juin",2005,38504,"2005-06-30","1900-03-01T21:36:00",57.4]
["2005-07-01","2005-07-31",2.7,132.6,"Juillet",2005,38534,"2005-07-31","1900-01-10T04:48:00",84.5]
["2005-08-01","2005-08-31",6.2,122.1,"Août",2005,38565,"2005-08-31","1900-01-16T19:12:00",55.5]
["2005-09-01","2005-09-30",54.3,37.1,"Septembre",2005,38596,"2005-09-30","1900-04-20T02:24:00",13.2]
["2005-10-01","2005-10-31",253,8.6,"Octobre",2005,38626,"2005-10-31","1900-10-19T14:24:00",0.39999999999999858]
["2005-11-01","2005-11-30",454.7,0,"Novembre",2005,38657,"2005-11-30","1901-06-20T02:24:00",0]
["2005-12-01","2005-12-31",682.6,0,"Décembre",2005,38687,"2005-12-31","1902-03-21T19:12:00",0]
["2006-01-01","2006-01-31",697.4,0,"Janvier",2006,38718,"2006-01-31","1902-02-15T04:48:00",0]
["2006-02-01","2006-02-28",694,0,"Février",2006,38749,"2006-02-28","1902-02-27T12:00:00",0]
["2006-03-01","2006-03-31",576.5,0,"Mars",2006,38777,"2006-03-31","1901-09-23",0]
["2006-04-01","2006-04-30",313,0,"Avril",2006,38808,"2006-04-30","1901-01-09T14:24:00",0]
["2006-05-01","2006-05-31",126.6,17.8,"Mai",2006,38838,"2006-05-31","1900-06-19T09:36:00",1.5]
["2006-06-01","2006-06-30",23.8,59,"Juin",2006,38869,"2006-06-30","1900-02-05",35.4]
["2006-07-01","2006-07-31",0,141.9,"Juillet",2006,38899,"2006-07-31","1900-01-04T12:00:00",89.9]
["2006-08-01","2006-08-31",23.9,65,"Août",2006,38930,"2006-08-31","1900-02-22T16:48:00",33]
["2006-09-01","2006-09-30",96.1,7.5,"Septembre",2006,38961,"2006-09-30","1900-05-30T12:00:00",0]
["2006-10-01","2006-10-31",312.89999999999998,0,"Octobre",2006,38991,"2006-10-31","1900-12-15T04:48:00",0]
["2006-11-01","2006-11-30",407.2,0,"Novembre",2006,39022,"2006-11-30","1901-03-27T04:48:00",0]
["2006-12-01","2006-12-31",595.9,0,"Décembre",2006,39052,"2006-12-31","1901-12-03T14:24:00",0]
["2007-01-01","2007-01-31",775.6,0,"Janvier",2007,39083,"2007-01-31","1902-05-29T14:24:00",0]
["2007-02-01","2007-02-28",809.7,0,"Février",2007,39114,"2007-02-28","1902-05-13T09:36:00",0]
["2007-03-01","2007-03-31",644.9,0,"Mars",2007,39142,"2007-03-31","1901-12-22T21:36:00",0]
["2007-04-01","2007-04-30",366.4,0,"Avril",2007,39173,"2007-04-30","1901-03-16T21:36:00",0]
["2007-05-01","2007-05-31",152.9,18,"Mai",2007,39203,"2007-05-31","1900-07-14T14:24:00",11.7]
["2007-06-01","2007-06-30",26,74.900000000000006,"Juin",2007,39234,"2007-06-30","1900-02-28T04:48:00",21.9]
["2007-07-01","2007-07-31"," ",82.1,"Juillet",2007,39264,"2007-07-31","1900-01-21T14:24:00",51]
["2007-08-01","2007-08-31",15.5,80.8,"Août",2007,39295,"2007-08-31","1900-02-16T14:24:00",25.4]
["2007-09-01","2007-09-30",69.900000000000006,30.1,"Septembre",2007,39326,"2007-09-30","1900-05-08T09:36:00",11.4]
["2007-10-01","2007-10-31",207.9,3.1,"Octobre",2007,39356,"2007-10-31","1900-09-20T12:00:00",0]
["2007-11-01","2007-11-30",509.7,0,"Novembre",2007,39387,"2007-11-30","1901-07-07T09:36:00",0]
["2007-12-01","2007-12-31",756.4,0,"Décembre",2007,39417,"2007-12-31","1902-04-18T04:48:00",0]
["2008-01-01","2008-01-31",749.3,0,"Janvier",2008,39448,"2008-01-31","1902-05-01T16:48:00",0]
["2008-02-01","2008-02-29",744.7,0,"Février",2008,39479,"2008-02-29","1902-04-03T16:48:00",0]
["2008-03-01","2008-03-31",690.8,0,"Mars",2008,39508,"2008-03-31","1902-02-03T19:12:00",0]
["2008-04-01","2008-04-30",296,0,"Avril",2008,39539,"2008-04-30","1901-01-31T19:12:00",0]
["2008-05-01","2008-05-31",172.3,0,"Mai",2008,39569,"2008-05-31","1900-08-13T07:12:00",0]
["2008-06-01","2008-06-30",16.8,72.400000000000006,"Juin",2008,39600,"2008-06-30","1900-02-20T07:12:00",17]
["2008-07-01","2008-07-31",0,106.8,"Juillet",2008,39630,"2008-07-31","1900-01-04T12:00:00",50.3]
["2008-08-01","2008-08-31",10.8,62.7,"Août",2008,39661,"2008-08-31","1900-01-22T21:36:00",22.6]
["2008-09-01","2008-09-30",72.099999999999994,33,"Septembre",2008,39692,"2008-09-30","1900-05-11T14:24:00",9.6]
["2008-10-01","2008-10-31",307.10000000000002,0,"Octobre",2008,39722,"2008-10-31","1900-12-16T19:12:00",0]
["2008-11-01","2008-11-30",467.9,0,"Novembre",2008,39753,"2008-11-30","1901-05-28T12:00:00",0]
["2008-12-01","2008-12-31",763.6,0,"Décembre",2008,39783,"2008-12-31","1902-04-22T04:48:00",0]
["2009-01-01","2009-01-31",956.2,0,"Janvier",2009,39814,"2009-01-31","1902-11-18",0]
["2009-02-01","2009-02-28",701,0,"Février",2009,39845,"2009-02-28","1902-01-25",0]
["2009-03-01","2009-03-31",590.79999999999995,0,"Mars",2009,39873,"2009-03-31","1901-11-26T04:48:00",0]
["2009-04-01","2009-04-30",313.8,3.3,"Avril",2009,39904,"2009-04-30","1900-12-28T21:36:00",0]
["2009-05-01","2009-05-31",165.8,1,"Mai",2009,39934,"2009-05-31","1900-08-19T12:00:00",0]
["2009-06-01","2009-06-30",45.6,44.1,"Juin",2009,39965,"2009-06-30","1900-03-09",12.7]
["2009-07-01","2009-07-31",7.8,70.7,"Juillet",2009,39995,"2009-07-31","1900-02-03T09:36:00",27]
["2009-08-01","2009-08-31",20.100000000000001,106.3,"Août",2009,40026,"2009-08-31","1900-02-02T07:12:00",74.900000000000006]
["2009-09-01","2009-09-30",90.6,8.9,"Septembre",2009,40057,"2009-09-30","1900-05-15T16:48:00",2.6]
["2009-10-01","2009-10-31",342.7,0,"Octobre",2009,40087,"2009-10-31","1901-02-04T12:00:00",0]
["2009-11-01","2009-11-30",407.3,0,"Novembre",2009,40118,"2009-11-30","1901-04-01T04:48:00",0]
["2009-12-01","2009-12-31",724.6,0,"Décembre",2009,40148,"2009-12-31","1902-02-18T04:48:00",0]
["2010-01-01","2010-01-31",756.3,0,"Janvier",2010,40179,"2010-01-31","1902-03-04T04:48:00",0]
["2010-02-01","2010-02-28",636.29999999999995,0,"Février",2010,40210,"2010-02-28","1901-10-13T07:12:00",0]
["2010-03-01","2010-03-31",456.9,0,"Mars",2010,40238,"2010-03-31","1901-07-01T07:12:00",0]
["2010-04-01","2010-04-30",256.3,0.10000000000000142,"Avril",2010,40269,"2010-04-30","1900-11-11T12:00:00",0]
["2010-05-01","2010-05-31",107.9,36.6,"Mai",2010,40299,"2010-05-31","1900-06-09T07:12:00",15.1]
["2010-06-01","2010-06-30",32.4,43.7,"Juin",2010,40330,"2010-06-30","1900-02-26",23.3]
["2010-07-01","2010-07-31",4.9000000000000004,160,"Juillet",2010,40360,"2010-07-31","1900-01-12T16:48:00",119.2]
["2010-08-01","2010-08-31",9.4,99.2,"Août",2010,40391,"2010-08-31","1900-01-19T09:36:00",59]
["2010-09-01","2010-09-30",84.4,32.700000000000003,"Septembre",2010,40422,"2010-09-30","1900-05-26T14:24:00",16.399999999999999]
["2010-10-01","2010-10-31",300.5,0,"Octobre",2010,40452,"2010-10-31","1900-12-18T09:36:00",0]
["2010-11-01","2010-11-30",466.6,0,"Novembre",2010,40483,"2010-11-30","1901-06-09T16:48:00",0]
["2010-12-01","2010-12-31",739,0,"Décembre",2010,40513,"2010-12-31","1902-02-05T12:00:00",0]
["2011-01-01","2011-01-31",851.5,0,"Janvier",2011,40544,"2011-01-31","1902-05-25",0]
["2011-02-01","2011-02-28",716.1,0,"Février",2011,40575,"2011-02-28","1902-02-11T16:48:00",0]
["2011-03-01","2011-03-31",618.4,0,"Mars",2011,40603,"2011-03-31","1901-11-26T19:12:00",0]
["2011-04-01","2011-04-30",341.6,0,"Avril",2011,40634,"2011-04-30","1901-03-11T07:12:00",0]
["2011-05-01","2011-05-31",138,12.8,"Mai",2011,40664,"2011-05-31","1900-08-07T21:36:00",2.1]
["2011-06-01","2011-06-30",19.399999999999999,59.7,"Juin",2011,40695,"2011-06-30","1900-02-23T04:48:00",18.3]
["2011-07-01","2011-07-31",0,156.69999999999999,"Juillet",2011,40725,"2011-07-31","1900-01-04T19:12:00",85]
["2011-08-01","2011-08-31",2.4,95.8,"Août",2011,40756,"2011-08-31","1900-01-19T12:00:00",37.6]
["2011-09-01","2011-09-30",46.6,38.700000000000003,"Septembre",2011,40787,40816,84,9.1]
["2011-10-01","2011-10-31",252,1.4,"Octobre",2011,40817,40847,305.10000000000002,0]
["2011-11-01","2011-11-30",381.6,0,"Novembre",2011,40848,40877,454.3,0]
["2011-12-01","2011-12-31",637.6,0,"Décembre",2011,40878,40908,736,0]
["2012-01-01","2012-01-31",788.3,0,"Janvier",2012]
["2012-02-01","2012-02-29",659.7,0,"Février",2012]
["2012-03-01","2012-03-31",462.8,0,"Mars",2012]
["2012-04-01","2012-04-30",339.2,3.7,"Avril",2012]
["2012-05-01","2012-05-31",89.9,23.8,"Mai",2012]
["2012-06-01","2012-06-30",21.5,80.400000000000006,"Juin",2012]
["2012-07-01","2012-07-31",0.7,133.80000000000001,"Juillet",2012]
["2012-08-01","2012-08-31",0.8,129.69999999999999,"Août",2012]
["2012-09-01","2012-09-30",92.5,"-","Septembre",2012]
["2012-10-01","2012-10-31",222.8,"-","Octobre",2012]
["2012-11-01","2012-11-30",524.20000000000005,"-","Novembre",2012]
["2012-12-01","2012-12-31",666.5,"-","Décembre",2012]
["2013-01-01","2013-01-31",808.2,"-","Janvier",2013]
["2013-02-01","2013-02-28",698,"-","Février",2013]
["2013-03-01","2013-03-31",575.1,"-","Mars",2013]
["2013-04-01","2013-04-30",358.6,"-","Avril",2013]
["2013-05-01","2013-05-31",106.5,"-","Mai",2013]
["2013-06-01","2013-06-30",47.7,"-","Juin",2013]
["2013-07-01","2013-07-31",4.0999999999999996,"-","Juillet",2013]
["2013-08-01","2013-08-31",3.4,"-","Août",2013]
["2013-09-01","2013-09-30",99.5,"-","Septembre",2013]
["2013-10-01","2013-10-31",236.5,"-","Octobre",2013]
["2013-11-01","2013-11-30",514,"-","Novembre",2013]
["2013-12-01","2013-12-31",817.5,"-","Décembre",2013]
["2014-01-01","2014-01-31",873.9,"-","Janvier",2014]
["2014-02-01","2014-02-28",754.6,"-","Février",2014]
["2014-03-01","2014-03-31",746.2,"-","Mars",2014]
["2014-04-01","2014-04-30",368.1,"-","Avril",2014]
["2014-05-01","2014-05-31",118.9,"-","Mai",2014]
["2014-06-01","2014-06-30",10.1,"-","Juin",2014]
["2014-07-01","2014-07-31",2.9,"-","Juillet",2014]
["2014-08-01","2014-08-31",10.6,"-","Août",2014]
["2014-09-01","2014-09-30",97.6,"-","Septembre",2014]
["2014-10-01","2014-10-31",224.1,"-","Octobre",2014]
["2014-11-01","2014-11-30",484,"-","Novembre",2014]
["2014-12-01","2014-12-31",664.7,"-","Décembre",2014]
["2015-01-01","2015-01-31",926.3,"-","Janvier",2015]
["2015-02-01","2015-02-28",929.3,"-","Février",2015]
["2015-03-01","2015-03-31",706.5,"-","Mars",2015]
["2015-04-01","2015-04-30",351.6,"-","Avril",2015]
["2015-05-01","2015-05-31",73,"-","Mai",2015]
["2015-06-01","2015-06-30",40.1,"-","Juin",2015]
["2015-07-01","2015-07-31",1.1000000000000001,"-","Juillet",2015]
["2015-08-01","2015-08-31",0.9,"-","Août",2015]
["2015-09-01","2015-09-30",39.5,"-","Septembre",2015]
["2015-10-01","2015-10-31",311.7,"-","Octobre",2015]
["2015-11-01","2015-11-30",384.2,"-","Novembre",2015]
["2015-12-01","2015-12-31",489.7,"-","Décembre",2015]
["2016-01-01","2016-01-31",723,"-","Janvier",2016]
["2016-02-01","2016-02-29",641.79999999999995,"-","Février",2016]
["2016-03-01","2016-03-31",554.79999999999995,"-","Mars",2016]
["2016-04-01","2016-04-30",417.7,"-","Avril",2016]
["2016-05-01","2016-05-31",132.19999999999999,"-","Mai",2016]
["2016-06-01","2016-06-30",31.2,"-","Juin",2016]
["2016-07-01","2016-07-31",3.4,"-","Juillet",2016]
["2016-08-01","2016-08-31",0.6,"-","Août",2016]
["2016-09-01","2016-09-30",48,"-","Septembre",2016]
["2016-10-01","2016-10-31",254.1,"-","Octobre",2016]
["2016-11-01","2016-11-30",406.9,"-","Novembre",2016]
["2016-12-01","2016-12-31",690.4,"-","Décembre",2016]
["2017-01-01","2017-01-31",699,"-","Janvier",2017]
["2017-02-01","2017-02-28",607.5,"-","Février",2017]
["2017-03-01","2017-03-31",660.9,"-","Mars",2017]
["2017-04-01","2017-04-30",300.7,"-","Avril",2017]
["2017-05-01","2017-05-31",157.30000000000001,"-","Mai",2017]
["2017-06-01","2017-06-30",30.2,"-","Juin",2017]
["2017-07-01","2017-07-31",0.8,"-","Juillet",2017]
["2017-08-01","2017-08-31",14,"-","Août",2017]
["2017-09-01","2017-09-30",51.8,"-","Septembre",2017]
["2017-10-01","2017-10-31",14,"-","Octobre",2017]
["2017-11-01","2017-11-30",479.5,"-","Novembre",2017]
["2017-12-01","2017-12-31",823.6,"-","Décembre",2017]
["2018-01-01","2018-01-31",859.2,"-","Janvier",2018]
["2018-02-01","2018-02-28",631.79999999999995,"-","Février",2018]
["2018-03-01","2018-03-31",586.5,"-","Mars",2018]
["2018-04-01","2018-04-30",422.4,"-","Avril",2018]
["2018-05-01","2018-05-31",80.099999999999994,"-","Mai",2018]
["2018-06-01","2018-06-30",27.1,"-","Juin",2018]
["2018-07-01","2018-07-31",0,"-","Juillet",2018]
["2018-08-01","2018-08-31",0.1,"-","Août",2018]
["2018-09-01","2018-09-30",69.7,"-","Septembre",2018]
["2018-10-01","2018-10-31",262.39999999999998,"-","Octobre",2018]
["2018-11-01","2018-11-30",543.5,"-","Novembre",2018]
["2018-12-01","2018-12-31",689.3,"-","Décembre",2018]
["2019-01-01","2019-01-31",877.4,"-","Janvier",2019]
["2019-02-01","2019-02-28",736.4,"-","Février",2019]
["2019-03-01","2019-03-31",638.79999999999995,"-","Mars",2019]
["2019-04-01","2019-04-30",377.4,"-","Avril",2019]
["2019-05-01","2019-05-31",185.7,"-","Mai",2019]
["2019-06-01","2019-06-30",41,"-","Juin",2019]
["2019-07-01","2019-07-31",0,"-","Juillet",2019]
["2019-08-01","2019-08-31",2,"-","Août",2019]
["2019-09-01","2019-09-30",78.400000000000006,"-","Septembre",2019]
["2019-10-01","2019-10-31",245.7,"-","Octobre",2019]
["2019-11-01","2019-11-30",533.29999999999995,"-","Novembre",2019]
["2019-12-01","2019-12-31",688.8,"-","Décembre",2019]
["2020-01-01","2020-01-31",731,"-","Janvier",2020]
["2020-02-01","2020-02-29",693.5,"-","Février",2020]
["2020-03-01","2020-03-31",528.9,"-","Mars",2020]
["2020-04-01","2020-04-30",382.5,"-","Avril",2020]
["2020-05-01","2020-05-31",176.7,"-","Mai",2020]
["2020-06-01","2020-06-30",36.9,"-","Juin",2020]
["2020-07-01","2020-07-31",0,"-","Juillet",2020]
["2020-08-01","2020-08-31",17.5,"-","Août",2020]
["2020-09-01","2020-09-30",100.2,"-","Septembre",2020]
["2020-10-01","2020-10-31",284.60000000000002,"-","Octobre",2020]
["2020-11-01","2020-11-30",0,"-","Novembre",2020]
["2020-12-01","2020-12-31",0,"-","Décembre",2020]
["2021-01-01","2021-01-31",0,"-","Janvier",2021]
["2021-02-01","2021-02-28",0,"-","Février",2021]
["2021-03-01","2021-03-31",0,"-","Mars",2021]
["2021-04-01","2021-04-30",0,"-","Avril",2021]
["2021-05-01","2021-05-31",0,"-","Mai",2021]
["2021-06-01","2021-06-30",0,"-","Juin",2021]
["2021-07-01","2021-07-31",0,"-","Juillet",2021]
["2021-08-01","2021-08-31",0,"-","Août",2021]
[44440,44469,0,"-","Septembre",2021]
[44470,44500,0,"-","Octobre",2021]
[44501,44530,0,"-","Novembre",2021]
[44531,44561,0,"-","Décembre",2021]

{"sheet":"RÉSUMÉ","index":15,"n_rows":68,"n_cols":44,"rows_kept":68,"cut":false,"hidden":false,"merged":[[0,36,0,37],[0,1,0,3],[0,4,0,6],[0,9,0,10],[0,16,0,17],[0,18,0,19],[0,20,0,21],[0,7,0,8],[0,11,0,12],[0,26,0,27],[0,28,0,29],[0,32,0,33],[0,34,0,35],[0,30,0,31],[0,22,0,23],[0,24,0,25]]}
[null,"TOTAL",null,null,"Intensité énergétique",null,null,"GES",null,"Économie d'énergie",null,"Économie de coûts",null,"Économie de GES","Superficie","Nombre de bâtiments","Consommation électrique",null,"Gaz naturel",null,"Mazout n°2",null,"Mazout n°6",null,"Diesel génératrice",null,"Propane",null,"Résidus de bois\n (8 % d'humidité)",null,"Résidus de bois\n(35 % d'humidité)",null,"Vapeur",null,"Eau refroidie",null,"Eau chaude",null,"DJC","Superficie contient des surfaces louées","Valeurs de consommation proviennent de surfaces des surfaces louées","Projet(s) modifiant la superficie fait(s) lors de l'année de suivi","Taxes de ventes inclues dans le montant dépensé en énergie","Murs extérieurs exclus de la superficie"]
[null," [GJ réel]","[GJ 09-10 ajusté]","[$ réel]","[GJ réel/m²]","[GJ 09-10 ajusté/m²]","[$ réel/m²]","[t éq. CO2]","[kg éq. CO2/m²]","[GJ ajusté/m²]","[%]","[$ réel/m²]","[%]","[t éq. CO2]","[m²]",null," [kWh]"," [$]"," [m³]"," [$]"," [l]"," [$]"," [l]"," [$]"," [l]"," [$]"," [l]"," [$]"," [1000 kg MG]"," [$]"," [1000 kg MG]"," [$]","[lbs]"," [$]","[MBTU]"," [$]","[MBTU]"," [$]"," [° C]"," [VRAI/FAUX]"," [VRAI/FAUX]"," [VRAI/FAUX]"," [VRAI/FAUX]"," [VRAI/FAUX]"]
["s",{"$f":"GJ_Tot_02_03","v":{"$error":"#REF!"}},null,{"$f":"CAD_Tot_02_03","v":{"$error":"#REF!"}},{"$f":"IF(ISERROR(GJ_Tot_02_03/O3),0,(GJ_Tot_02_03/O3))","v":0},null,{"$f":"IF(ISERROR(CAD_Tot_02_03/O3),0,(CAD_Tot_02_03/O3))","v":0},{"$f":"GES_ton_02_03","v":{"$error":"#REF!"}},{"$f":"(IF(ISERROR(GES_ton_02_03/O3),0,(GES_ton_02_03/O3)))*1000","v":0},null,null,null,null,null,{"$f":"IF(ISERROR(Sup_02_03),0,(Sup_02_03))","v":0},{"$f":"#REF!","v":{"$error":"#REF!"}},{"$f":"Elec_kWh_02_03","v":{"$error":"#REF!"}},{"$f":"Elec_CAD_02_03","v":{"$error":"#REF!"}},{"$f":"GN_m³_02_03","v":{"$error":"#REF!"}},{"$f":"GN_CAD_02_03","v":{"$error":"#REF!"}},{"$f":"Ma2_l_02_03","v":{"$error":"#REF!"}},{"$f":"Ma2_CAD_02_03","v":{"$error":"#REF!"}},{"$f":"Ma6_l_02_03","v":{"$error":"#REF!"}},{"$f":"Ma6_CAD_02_03","v":{"$error":"#REF!"}},null,null,{"$f":"Prop_l_02_03","v":{"$error":"#REF!"}},{"$f":"Prop_CAD_02_03","v":{"$error":"#REF!"}},{"$f":"Bois20_1000kg_02_03","v":{"$error":"#REF!"}},{"$f":"Bois20_CAD_02_03","v":{"$error":"#REF!"}},{"$f":"Bois45_1000kg_02_03","v":{"$error":"#REF!"}},{"$f":"Bois45_CAD_02_03","v":{"$error":"#REF!"}},{"$f":"0","v":0},{"$f":"0","v":0},{"$f":"0","v":0},{"$f":"0","v":0},{"$f":"0","v":0},{"$f":"0","v":0},{"$f":"DJC_tot_02_03","v":{"$error":"#REF!"}}]
["2003-2004",{"$f":"GJ_Tot_03_04","v":{"$error":"#REF!"}},null,{"$f":"CAD_Tot_03_04","v":{"$error":"#REF!"}},{"$f":"IF(ISERROR(GJ_Tot_03_04/O4),0,(GJ_Tot_03_04/O4))","v":0},null,{"$f":"IF(ISERROR(CAD_Tot_03_04/O4),0,(CAD_Tot_03_04/O4))","v":0},{"$f":"GES_ton_03_04","v":{"$error":"#REF!"}},{"$f":"IF(ISERROR(GES_ton_03_04/O4),0,(GES_ton_03_04/O4))*1000","v":0},null,null,null,null,null,{"$f":"IF(ISERROR(Sup_03_04),0,(Sup_03_04))","v":0},{"$f":"#REF!","v":{"$error":"#REF!"}},{"$f":"Elec_kWh_03_04","v":{"$error":"#REF!"}},{"$f":"Elec_CAD_03_04","v":{"$error":"#REF!"}},{"$f":"GN_m³_03_04","v":{"$error":"#REF!"}},{"$f":"GN_CAD_03_04","v":{"$error":"#REF!"}},{"$f":"Ma2_l_03_04","v":{"$error":"#REF!"}},{"$f":"Ma2_CAD_03_04","v":{"$error":"#REF!"}},{"$f":"Ma6_l_03_04","v":{"$error":"#REF!"}},{"$f":"Ma6_CAD_03_04","v":{"$error":"#REF!"}},null,null,{"$f":"Prop_l_03_04","v":{"$error":"#REF!"}},{"$f":"Prop_CAD_03_04","v":{"$error":"#REF!"}},{"$f":"Bois20_1000kg_03_04","v":{"$error":"#REF!"}},{"$f":"Bois20_CAD_03_04","v":{"$error":"#REF!"}},{"$f":"Bois45_1000kg_03_04","v":{"$error":"#REF!"}},{"$f":"Bois45_CAD_03_04","v":{"$error":"#REF!"}},{"$f":"0","v":0},{"$f":"0","v":0},{"$f":"0","v":0},{"$f":"0","v":0},{"$f":"0","v":0},{"$f":"0","v":0},{"$f":"DJC_tot_03_04","v":{"$error":"#REF!"}}]
["2004-2005",{"$f":"GJ_Tot_04_05","v":{"$error":"#REF!"}},null,{"$f":"CAD_Tot_04_05","v":{"$error":"#REF!"}},{"$f":"IF(ISERROR(GJ_Tot_04_05/O5),0,(GJ_Tot_04_05/O5))","v":0},null,{"$f":" IF(ISERROR(CAD_Tot_04_05/O5),0,(CAD_Tot_04_05/O5))","v":0},{"$f":"GES_ton_04_05","v":{"$error":"#REF!"}},{"$f":"IF(ISERROR(GES_ton_04_05/O5),0,(GES_ton_04_05/O5))*1000","v":0},null,null,null,null,null,{"$f":"IF(ISERROR(Sup_04_05),0,(Sup_04_05))","v":0},{"$f":"#REF!","v":{"$error":"#REF!"}},{"$f":"Elec_kWh_04_05","v":{"$error":"#REF!"}},{"$f":"Elec_CAD_04_05","v":{"$error":"#REF!"}},{"$f":"GN_m³_04_05","v":{"$error":"#REF!"}},{"$f":"GN_CAD_04_05","v":{"$error":"#REF!"}},{"$f":"Ma2_l_04_05","v":{"$error":"#REF!"}},{"$f":"Ma2_CAD_04_05","v":{"$error":"#REF!"}},{"$f":"Ma6_l_04_05","v":{"$error":"#REF!"}},{"$f":"Ma6_CAD_04_05","v":{"$error":"#REF!"}},null,null,{"$f":"Prop_l_04_05","v":{"$error":"#REF!"}},{"$f":"Prop_CAD_04_05","v":{"$error":"#REF!"}},{"$f":"Bois20_1000kg_04_05","v":{"$error":"#REF!"}},{"$f":"Bois20_CAD_04_05","v":{"$error":"#REF!"}},{"$f":"Bois45_1000kg_04_05","v":{"$error":"#REF!"}},{"$f":"Bois45_CAD_04_05","v":{"$error":"#REF!"}},{"$f":"0","v":0},{"$f":"0","v":0},{"$f":"0","v":0},{"$f":"0","v":0},{"$f":"0","v":0},{"$f":"0","v":0},{"$f":"DJC_tot_04_05","v":{"$error":"#REF!"}}]
["2005-2006",{"$f":"GJ_Tot_05_06","v":{"$error":"#REF!"}},null,{"$f":"CAD_Tot_05_06","v":{"$error":"#REF!"}},{"$f":"IF(ISERROR(GJ_Tot_05_06/O6),0,(GJ_Tot_05_06/O6))","v":0},null,{"$f":" IF(ISERROR(CAD_Tot_05_06/O6),0,(CAD_Tot_05_06/O6))","v":0},{"$f":"GES_ton_05_06","v":{"$error":"#REF!"}},{"$f":"IF(ISERROR(GES_ton_05_06/O6),0,(GES_ton_05_06/O6))*1000","v":0},null,null,null,null,null,{"$f":"IF(ISERROR(Sup_05_06),0,(Sup_05_06))","v":0},{"$f":"#REF!","v":{"$error":"#REF!"}},{"$f":"Elec_kWh_05_06","v":{"$error":"#REF!"}},{"$f":"Elec_CAD_05_06","v":{"$error":"#REF!"}},{"$f":"GN_m³_05_06","v":{"$error":"#REF!"}},{"$f":"GN_CAD_05_06","v":{"$error":"#REF!"}},{"$f":"Ma2_l_05_06","v":{"$error":"#REF!"}},{"$f":"Ma2_CAD_05_06","v":{"$error":"#REF!"}},{"$f":"Ma6_l_05_06","v":{"$error":"#REF!"}},{"$f":"Ma6_CAD_05_06","v":{"$error":"#REF!"}},null,null,{"$f":"Prop_l_05_06","v":{"$error":"#REF!"}},{"$f":"Prop_CAD_05_06","v":{"$error":"#REF!"}},{"$f":"Bois20_1000kg_05_06","v":{"$error":"#REF!"}},{"$f":"Bois20_CAD_05_06","v":{"$error":"#REF!"}},{"$f":"Bois45_1000kg_05_06","v":{"$error":"#REF!"}},{"$f":"Bois45_CAD_05_06","v":{"$error":"#REF!"}},{"$f":"0","v":0},{"$f":"0","v":0},{"$f":"0","v":0},{"$f":"0","v":0},{"$f":"0","v":0},{"$f":"0","v":0},{"$f":"DJC_tot_05_06","v":{"$error":"#REF!"}}]
["2006-2007",{"$f":"GJ_Tot_06_07","v":{"$error":"#REF!"}},null,{"$f":"CAD_Tot_06_07","v":{"$error":"#REF!"}},{"$f":"IF(ISERROR(GJ_Tot_06_07/O7),0,(GJ_Tot_06_07/O7))","v":0},null,{"$f":"IF(ISERROR(CAD_Tot_06_07/O7),0,(CAD_Tot_06_07/O7))","v":0},{"$f":"GES_ton_06_07","v":{"$error":"#REF!"}},{"$f":"IF(ISERROR(GES_ton_06_07/O7),0,(GES_ton_06_07/O7))*1000","v":0},null,null,null,null,null,{"$f":"IF(ISERROR(Sup_06_07),0,(Sup_06_07))","v":0},{"$f":"#REF!","v":{"$error":"#REF!"}},{"$f":"Elec_kWh_06_07","v":{"$error":"#REF!"}},{"$f":"Elec_CAD_06_07","v":{"$error":"#REF!"}},{"$f":"GN_m³_06_07","v":{"$error":"#REF!"}},{"$f":"GN_CAD_06_07","v":{"$error":"#REF!"}},{"$f":"Ma2_l_06_07","v":{"$error":"#REF!"}},{"$f":"Ma2_CAD_06_07","v":{"$error":"#REF!"}},{"$f":"Ma6_l_06_07","v":{"$error":"#REF!"}},{"$f":"Ma6_CAD_06_07","v":{"$error":"#REF!"}},null,null,{"$f":"Prop_l_06_07","v":{"$error":"#REF!"}},{"$f":"Prop_CAD_06_07","v":{"$error":"#REF!"}},{"$f":"Bois20_1000kg_06_07","v":{"$error":"#REF!"}},{"$f":"Bois20_CAD_06_07","v":{"$error":"#REF!"}},{"$f":"Bois45_1000kg_06_07","v":{"$error":"#REF!"}},{"$f":"Bois45_CAD_06_07","v":{"$error":"#REF!"}},{"$f":"0","v":0},{"$f":"0","v":0},{"$f":"0","v":0},{"$f":"0","v":0},{"$f":"0","v":0},{"$f":"0","v":0},{"$f":"DJC_tot_06_07","v":{"$error":"#REF!"}}]
["2007-2008",{"$f":"GJ_Tot_07_08","v":{"$error":"#REF!"}},null,{"$f":"CAD_Tot_07_08","v":{"$error":"#REF!"}},{"$f":"IF(ISERROR(GJ_Tot_07_08/O8),0,(GJ_Tot_07_08/O8))","v":0},null,{"$f":" IF(ISERROR(CAD_Tot_07_08/O8),0,(CAD_Tot_07_08/O8))","v":0},{"$f":"GES_ton_07_08","v":{"$error":"#REF!"}},{"$f":"IF(ISERROR(GES_ton_07_08/O8),0,(GES_ton_07_08/O8))*1000","v":0},null,null,null,null,null,{"$f":"IF(ISERROR(Sup_07_08),0,(Sup_07_08))","v":0},{"$f":"#REF!","v":{"$error":"#REF!"}},{"$f":"Elec_kWh_07_08","v":{"$error":"#REF!"}},{"$f":"Elec_CAD_07_08","v":{"$error":"#REF!"}},{"$f":"GN_m³_07_08","v":{"$error":"#REF!"}},{"$f":"GN_CAD_07_08","v":{"$error":"#REF!"}},{"$f":"Ma2_l_07_08","v":{"$error":"#REF!"}},{"$f":"Ma2_CAD_07_08","v":{"$error":"#REF!"}},{"$f":"Ma6_l_07_08","v":{"$error":"#REF!"}},{"$f":"Ma6_CAD_07_08","v":{"$error":"#REF!"}},null,null,{"$f":"Prop_l_07_08","v":{"$error":"#REF!"}},{"$f":"Prop_CAD_07_08","v":{"$error":"#REF!"}},{"$f":"Bois20_1000kg_07_08","v":{"$error":"#REF!"}},{"$f":"Bois20_CAD_07_08","v":{"$error":"#REF!"}},{"$f":"Bois45_1000kg_07_08","v":{"$error":"#REF!"}},{"$f":"Bois45_CAD_07_08","v":{"$error":"#REF!"}},{"$f":"0","v":0},{"$f":"0","v":0},{"$f":"0","v":0},{"$f":"0","v":0},{"$f":"0","v":0},{"$f":"0","v":0},{"$f":"DJC_tot_07_08","v":{"$error":"#REF!"}}]
["2008-2009",{"$f":"GJ_Tot_08_09","v":{"$error":"#REF!"}},null,{"$f":"CAD_Tot_08_09","v":{"$error":"#REF!"}},{"$f":"IF(ISERROR(GJ_Tot_08_09/O9),0,(GJ_Tot_08_09/O9))","v":0},null,{"$f":" IF(ISERROR(CAD_Tot_08_09/O9),0,(CAD_Tot_08_09/O9))","v":0},{"$f":"GES_ton_08_09","v":{"$error":"#REF!"}},{"$f":"IF(ISERROR(GES_ton_08_09/O9),0,(GES_ton_08_09/O9))*1000","v":0},null,null,null,null,null,{"$f":"IF(ISERROR(Sup_08_09),0,(Sup_08_09))","v":0},{"$f":"#REF!","v":{"$error":"#REF!"}},{"$f":"Elec_kWh_08_09","v":{"$error":"#REF!"}},{"$f":"Elec_CAD_08_09","v":{"$error":"#REF!"}},{"$f":"GN_m³_08_09","v":{"$error":"#REF!"}},{"$f":"GN_CAD_08_09","v":{"$error":"#REF!"}},{"$f":"Ma2_l_08_09","v":{"$error":"#REF!"}},{"$f":"Ma2_CAD_08_09","v":{"$error":"#REF!"}},{"$f":"Ma6_l_08_09","v":{"$error":"#REF!"}},{"$f":"Ma6_CAD_08_09","v":{"$error":"#REF!"}},null,null,{"$f":"Prop_l_08_09","v":{"$error":"#REF!"}},{"$f":"Prop_CAD_08_09","v":{"$error":"#REF!"}},{"$f":"Bois20_1000kg_08_09","v":{"$error":"#REF!"}},{"$f":"Bois20_CAD_08_09","v":{"$error":"#REF!"}},{"$f":"Bois45_1000kg_08_09","v":{"$error":"#REF!"}},{"$f":"Bois45_CAD_08_09","v":{"$error":"#REF!"}},{"$f":"0","v":0},{"$f":"0","v":0},{"$f":"0","v":0},{"$f":"0","v":0},{"$f":"0","v":0},{"$f":"0","v":0},{"$f":"DJC_tot_08_09","v":{"$error":"#REF!"}}]
["2009-2010",{"$f":"IFERROR(GJ_Tot_09_10,0)","v":0},null,{"$f":"CAD_Tot_09_10","v":0},{"$f":"IF(ISERROR(GJ_Tot_09_10/O10),0,(GJ_Tot_09_10/O10))","v":0},null,{"$f":" IF(ISERROR(CAD_Tot_09_10/O10),0,(CAD_Tot_09_10/O10))","v":0},{"$f":"GES_ton_09_10","v":0},{"$f":"IF(ISERROR(GES_ton_09_10/O10),0,(GES_ton_09_10/O10))*1000","v":0},null,null,null,null,null,{"$f":"IF(ISERROR(Sup_09_10),0,(Sup_09_10))","v":0},{"$f":"nb_bât_09_10","v":0},{"$f":"Elec_kWh_09_10","v":0},{"$f":"Elec_CAD_09_10","v":0},{"$f":"GN_m³_09_10","v":0},{"$f":"GN_CAD_09_10","v":0},{"$f":"Ma2_l_09_10","v":0},{"$f":"Ma2_CAD_09_10","v":0},{"$f":"Ma6_l_09_10","v":0},{"$f":"Ma6_CAD_09_10","v":0},{"$f":"Dies_09_10","v":0},{"$f":"Dies_CAD_09_10","v":0},{"$f":"Prop_l_09_10","v":0},{"$f":"Prop_CAD_09_10","v":0},{"$f":"Bois20_1000kg_09_10","v":0},{"$f":"Bois20_CAD_09_10","v":0},{"$f":"Bois45_1000kg_09_10","v":0},{"$f":"Bois45_CAD_09_10","v":0},{"$f":"Vapeur_Lbs_09_10","v":0},{"$f":"Vapeur_CAD_09_10","v":0},{"$f":"EauRefroidie_MBTU_09_10","v":0},{"$f":"EauRefroidie_CAD_09_10","v":0},{"$f":"EauChaude_MBTU_09_10","v":0},{"$f":"EauChaude_CAD_09_10","v":0},{"$f":"DJC_tot_09_10","v":3967.8000000000006}]
["2010-2011",{"$f":"IFERROR(GJ_Tot_10_11,0)","v":0},{"$f":"GJTotRef_Ajust_10_11","v":0},{"$f":"CAD_Tot_10_11","v":0},{"$f":"IF(ISERROR(GJ_Tot_10_11/O11),0,(GJ_Tot_10_11/O11))","v":0},{"$f":"IF(ISERROR(GJTotRef_Ajust_10_11/O11),0,(GJTotRef_Ajust_10_11/O11))","v":0},{"$f":" IF(ISERROR(CAD_Tot_10_11/O11),0,(CAD_Tot_10_11/O11))","v":0},{"$f":"GES_ton_10_11","v":0},{"$f":"IF(ISERROR(GES_ton_10_11/O11),0,(GES_ton_10_11/O11))*1000","v":0},{"$f":"IF(ISERROR(F11-E11),0,(F11-E11))","v":0},{"$f":"IF(ISERROR(1-E11/F11),0,(1-E11/F11))","v":0},{"$f":"IF(ISERROR($G$10-G11),0,($G$10-G11))","v":0},{"$f":"IF(ISERROR(1-G11/$G$12),0,(1-G11/$G$12))","v":0},{"$f":"GES_ton_09_10-GES_ton_10_11","v":0},{"$f":"IF(ISERROR(Sup_10_11),0,(Sup_10_11))","v":0},{"$f":"nb_bât_10_11","v":0},{"$f":"Elec_kWh_10_11","v":0},{"$f":"Elec_CAD_10_11","v":0},{"$f":"GN_m³_10_11","v":0},{"$f":"GN_CAD_10_11","v":0},{"$f":"Ma2_l_10_11","v":0},{"$f":"Ma2_CAD_10_11","v":0},{"$f":"Ma6_l_10_11","v":0},{"$f":"Ma6_CAD_10_11","v":0},{"$f":"Dies_10_11","v":0},{"$f":"Dies_CAD_10_11","v":0},{"$f":"Prop_l_10_11","v":0},{"$f":"Prop_CAD_10_11","v":0},{"$f":"Bois20_1000kg_10_11","v":0},{"$f":"Bois20_CAD_10_11","v":0},{"$f":"Bois45_1000kg_10_11","v":0},{"$f":"Bois45_CAD_10_11","v":0},{"$f":"Vapeur_Lbs_10_11","v":0},{"$f":"Vapeur_CAD_10_11","v":0},{"$f":"EauRefroidie_MBTU_10_11","v":0},{"$f":"EauRefroidie_CAD_10_11","v":0},{"$f":"EauChaude_MBTU_10_11","v":0},{"$f":"EauChaude_CAD_10_11","v":0},{"$f":"DJC_tot_10_11","v":4187.3999999999996}]
["2011-2012",{"$f":"IFERROR(GJ_Tot_11_12,0)","v":0},{"$f":"GJTotRef_Ajust_11_12","v":0},{"$f":"CAD_Tot_11_12","v":0},{"$f":"IF(ISERROR(GJ_Tot_11_12/O12),0,(GJ_Tot_11_12/O12))","v":0},{"$f":"IF(ISERROR(GJTotRef_Ajust_11_12/O12),0,(GJTotRef_Ajust_11_12/O12))","v":0},{"$f":" IF(ISERROR(CAD_Tot_11_12/O12),0,(CAD_Tot_11_12/O12))","v":0},{"$f":"GES_ton_11_12","v":0},{"$f":"IF(ISERROR(GES_ton_11_12/O12),0,(GES_ton_11_12/O12))*1000","v":0},{"$f":"IF(ISERROR(F12-E12),0,(F12-E12))","v":0},{"$f":"IF(ISERROR(1-E12/F12),0,(1-E12/F12))","v":0},{"$f":"IF(ISERROR($G$10-G12),0,($G$10-G12))","v":0},{"$f":"IF(ISERROR(1-G12/$G$12),0,(1-G12/$G$12))","v":0},{"$f":"GES_ton_09_10-GES_ton_11_12","v":0},{"$f":"IF(ISERROR(Sup_11_12),0,(Sup_11_12))","v":0},{"$f":"nb_bât_11_12","v":0},{"$f":"Elec_kWh_11_12","v":0},{"$f":"Elec_CAD_11_12","v":0},{"$f":"GN_m³_11_12","v":0},{"$f":"GN_CAD_11_12","v":0},{"$f":"Ma2_l_11_12","v":0},{"$f":"Ma2_CAD_11_12","v":0},{"$f":"Ma6_l_11_12","v":0},{"$f":"Ma6_CAD_11_12","v":0},{"$f":"Dies_11_12","v":0},{"$f":"Dies_CAD_11_12","v":0},{"$f":"Prop_l_11_12","v":0},{"$f":"Prop_CAD_11_12","v":0},{"$f":"Bois20_1000kg_11_12","v":0},{"$f":"Bois20_CAD_11_12","v":0},{"$f":"Bois45_1000kg_11_12","v":0},{"$f":"Bois45_CAD_11_12","v":0},{"$f":"Vapeur_Lbs_11_12","v":0},{"$f":"Vapeur_CAD_11_12","v":0},{"$f":"EauRefroidie_MBTU_11_12","v":0},{"$f":"EauRefroidie_CAD_11_12","v":0},{"$f":"EauChaude_MBTU_11_12","v":0},{"$f":"EauChaude_CAD_11_12","v":0},{"$f":"DJC_tot_11_12","v":3730}]
["2012-2013",{"$f":"IFERROR(GJ_Tot_12_13,0)","v":0},{"$f":"GJTotRef_Ajust_12_13","v":0},{"$f":"CAD_Tot_12_13","v":0},{"$f":"IF(ISERROR(GJ_Tot_12_13/O13),0,(GJ_Tot_12_13/O13))","v":0},{"$f":"IF(ISERROR(GJTotRef_Ajust_12_13/O13),0,(GJTotRef_Ajust_12_13/O13))","v":0},{"$f":" IF(ISERROR(CAD_Tot_12_13/O13),0,(CAD_Tot_12_13/O13))","v":0},{"$f":"GES_ton_12_13","v":0},{"$f":"IF(ISERROR(GES_ton_12_13/O13),0,(GES_ton_12_13/O13))*1000","v":0},0,0,0,0,{"$f":"GES_ton_09_10-GES_ton_12_13","v":0},{"$f":"IF(ISERROR(Sup_12_13),0,(Sup_12_13))","v":0},{"$f":"nb_bât_12_13","v":0},{"$f":"Elec_kWh_12_13","v":0},{"$f":"Elec_CAD_12_13","v":0},{"$f":"GN_m³_12_13","v":0},{"$f":"GN_CAD_12_13","v":0},{"$f":"Ma2_l_12_13","v":0},{"$f":"Ma2_CAD_12_13","v":0},{"$f":"Ma6_l_12_13","v":0},{"$f":"Ma6_CAD_12_13","v":0},{"$f":"Dies_12_13","v":0},{"$f":"Dies_CAD_12_13","v":0},{"$f":"Prop_l_12_13","v":0},{"$f":"Prop_CAD_12_13","v":0},{"$f":"Bois20_1000kg_12_13","v":0},{"$f":"Bois20_CAD_12_13","v":0},{"$f":"Bois45_1000kg_12_13","v":0},{"$f":"Bois45_CAD_12_13","v":0},{"$f":"Vapeur_Lbs_12_13","v":0},{"$f":"Vapeur_CAD_12_13","v":0},{"$f":"EauRefroidie_MBTU_12_13","v":0},{"$f":"EauRefroidie_CAD_12_13","v":0},{"$f":"EauChaude_MBTU_12_13","v":0},{"$f":"EauChaude_CAD_12_13","v":0},{"$f":"DJC_tot_12_13","v":4039.4}]
["2013-2014",{"$f":"IFERROR(GJ_Tot_13_14,0)","v":0},{"$f":"GJTotRef_Ajust_13_14","v":0},{"$f":"CAD_Tot_13_14","v":0},{"$f":"IF(ISERROR(GJ_Tot_13_14/O14),0,(GJ_Tot_13_14/O14))","v":0},{"$f":"IF(ISERROR(GJTotRef_Ajust_13_14/O14),0,(GJTotRef_Ajust_13_14/O14))","v":0},{"$f":"IF(ISERROR(CAD_Tot_13_14/O14),0,(CAD_Tot_13_14/O14))","v":0},{"$f":"GES_ton_13_14","v":0},{"$f":"IF(ISERROR(GES_ton_13_14/O14),0,(GES_ton_13_14/O14))*1000","v":0},0,0,0,0,{"$f":"GES_ton_09_10-GES_ton_13_14","v":0},{"$f":"IF(ISERROR(Sup_13_14),0,(Sup_13_14))","v":0},{"$f":"nb_bât_13_14","v":0},{"$f":"Elec_kWh_13_14","v":0},{"$f":"Elec_CAD_13_14","v":0},{"$f":"GN_m³_13_14","v":0},{"$f":"GN_CAD_13_14","v":0},{"$f":"Ma2_l_13_14","v":0},{"$f":"Ma2_CAD_13_14","v":0},{"$f":"Ma6_l_13_14","v":0},{"$f":"Ma6_CAD_13_14","v":0},{"$f":"Dies_13_14","v":0},{"$f":"Dies_CAD_13_14","v":0},{"$f":"Prop_l_13_14","v":0},{"$f":"Prop_CAD_13_14","v":0},{"$f":"Bois20_1000kg_13_14","v":0},{"$f":"Bois20_CAD_13_14","v":0},{"$f":"Bois45_1000kg_13_14","v":0},{"$f":"Bois45_CAD_13_14","v":0},{"$f":"Vapeur_Lbs_13_14","v":0},{"$f":"Vapeur_CAD_13_14","v":0},{"$f":"EauRefroidie_MBTU_13_14","v":0},{"$f":"EauRefroidie_CAD_13_14","v":0},{"$f":"EauChaude_MBTU_13_14","v":0},{"$f":"EauChaude_CAD_13_14","v":0},{"$f":"DJC_tot_13_14","v":4562.5}]
["2014-2015",{"$f":"IFERROR(GJ_Tot_14_15,0)","v":0},{"$f":"GJTotRef_Ajust_14_15","v":0},{"$f":"CAD_Tot_14_15","v":0},{"$f":"IF(ISERROR(GJ_Tot_14_15/O15),0,(GJ_Tot_14_15/O15))","v":0},{"$f":"IF(ISERROR(GJTotRef_Ajust_14_15/O15),0,(GJTotRef_Ajust_14_15/O15))","v":0},{"$f":"IF(ISERROR(CAD_Tot_14_15/O15),0,(CAD_Tot_14_15/O15))","v":0},{"$f":"GES_ton_14_15","v":0},{"$f":"IF(ISERROR(GES_ton_14_15/O15),0,(GES_ton_14_15/O15))*1000","v":0},0,0,0,0,{"$f":"GES_ton_09_10-GES_ton_14_15","v":0},{"$f":"IF(ISERROR(Sup_14_15),0,(Sup_14_15))","v":0},{"$f":"nb_bât_14_15","v":0},{"$f":"Elec_kWh_14_15","v":0},{"$f":"Elec_CAD_14_15","v":0},{"$f":"GN_m³_14_15","v":0},{"$f":"GN_CAD_14_15","v":0},{"$f":"Ma2_l_14_15","v":0},{"$f":"Ma2_CAD_14_15","v":0},{"$f":"Ma6_l_14_15","v":0},{"$f":"Ma6_CAD_14_15","v":0},{"$f":"Dies_14_15","v":0},{"$f":"Dies_CAD_14_15","v":0},{"$f":"Prop_l_14_15","v":0},{"$f":"Prop_CAD_14_15","v":0},{"$f":"Bois20_1000kg_14_15","v":0},{"$f":"Bois20_CAD_14_15","v":0},{"$f":"Bois45_1000kg_14_15","v":0},{"$f":"Bois45_CAD_14_15","v":0},{"$f":"Vapeur_Lbs_14_15","v":0},{"$f":"Vapeur_CAD_14_15","v":0},{"$f":"EauRefroidie_MBTU_14_15","v":0},{"$f":"EauRefroidie_CAD_14_15","v":0},{"$f":"EauChaude_MBTU_14_15","v":0},{"$f":"EauChaude_CAD_14_15","v":0},{"$f":"DJC_tot_14_15","v":4543.1000000000004},false,false,false,false,false]
["2015-2016",{"$f":"IFERROR(GJ_Tot_15_16,0)","v":0},{"$f":"GJTotRef_Ajust_15_16","v":0},{"$f":"CAD_Tot_15_16","v":0},{"$f":"IF(ISERROR(GJ_Tot_15_16/O16),0,(GJ_Tot_15_16/O16))","v":0},{"$f":"IF(ISERROR(GJTotRef_Ajust_15_16/O16),0,(GJTotRef_Ajust_15_16/O16))","v":0},{"$f":"IF(ISERROR(CAD_Tot_15_16/O16),0,(CAD_Tot_15_16/O16))","v":0},{"$f":"GES_ton_15_16","v":0},{"$f":"IF(ISERROR(GES_ton_15_16/O16),0,(GES_ton_15_16/O16))*1000","v":0},0,0,0,0,{"$f":"GES_ton_09_10-GES_ton_15_16","v":0},{"$f":"IF(ISERROR(Sup_15_16),0,(Sup_15_16))","v":0},{"$f":"nb_bât_15_16","v":0},{"$f":"Elec_kWh_15_16","v":0},{"$f":"Elec_CAD_15_16","v":0},{"$f":"GN_m³_15_16","v":0},{"$f":"GN_CAD_15_16","v":0},{"$f":"Ma2_l_15_16","v":0},{"$f":"Ma2_CAD_15_16","v":0},{"$f":"Ma6_l_15_16","v":0},{"$f":"Ma6_CAD_15_16","v":0},{"$f":"Dies_15_16","v":0},{"$f":"Dies_CAD_15_16","v":0},{"$f":"Prop_l_15_16","v":0},{"$f":"Prop_CAD_15_16","v":0},{"$f":"Bois20_1000kg_15_16","v":0},{"$f":"Bois20_CAD_15_16","v":0},{"$f":"Bois45_1000kg_15_16","v":0},{"$f":"Bois45_CAD_15_16","v":0},{"$f":"Vapeur_Lbs_15_16","v":0},{"$f":"Vapeur_CAD_15_16","v":0},{"$f":"EauRefroidie_MBTU_15_16","v":0},{"$f":"EauRefroidie_CAD_15_16","v":0},{"$f":"EauChaude_MBTU_15_16","v":0},{"$f":"EauChaude_CAD_15_16","v":0},{"$f":"DJC_tot_15_16","v":3611.4000000000005},false,false,false,false,false]
["2016-2017",{"$f":"IFERROR(GJ_Tot_16_17,0)","v":0},{"$f":"GJTotRef_Ajust_16_17","v":0},{"$f":"CAD_Tot_16_17","v":0},{"$f":"IF(ISERROR(GJ_Tot_16_17/O17),0,(GJ_Tot_16_17/O17))","v":0},{"$f":"IF(ISERROR(GJTotRef_Ajust_16_17/O17),0,(GJTotRef_Ajust_16_17/O17))","v":0},{"$f":"IF(ISERROR(CAD_Tot_16_17/O17),0,(CAD_Tot_16_17/O17))","v":0},{"$f":"GES_ton_16_17","v":0},{"$f":"IF(ISERROR(GES_ton_16_17/O17),0,(GES_ton_16_17/O17))*1000","v":0},0,0,0,0,{"$f":"GES_ton_09_10-GES_ton_16_17","v":0},{"$f":"IF(ISERROR(Sup_16_17),0,(Sup_16_17))","v":0},{"$f":"nb_bât_16_17","v":0},{"$f":"Elec_kWh_16_17","v":0},{"$f":"Elec_CAD_16_17","v":0},{"$f":"GN_m³_16_17","v":0},{"$f":"GN_CAD_16_17","v":0},{"$f":"Ma2_l_16_17","v":0},{"$f":"Ma2_CAD_16_17","v":0},{"$f":"Ma6_l_16_17","v":0},{"$f":"Ma6_CAD_16_17","v":0},{"$f":"Dies_16_17","v":0},{"$f":"Dies_CAD_16_17","v":0},{"$f":"Prop_l_16_17","v":0},{"$f":"Prop_CAD_16_17","v":0},{"$f":"Bois20_1000kg_16_17","v":0},{"$f":"Bois20_CAD_16_17","v":0},{"$f":"Bois45_1000kg_16_17","v":0},{"$f":"Bois45_CAD_16_17","v":0},{"$f":"Vapeur_Lbs_16_17","v":0},{"$f":"Vapeur_CAD_16_17","v":0},{"$f":"EauRefroidie_MBTU_16_17","v":0},{"$f":"EauRefroidie_CAD_16_17","v":0},{"$f":"EauChaude_MBTU_16_17","v":0},{"$f":"EauChaude_CAD_16_17","v":0},{"$f":"DJC_tot_16_17","v":3951.9},false,false,false,false,false]
["2017-2018",{"$f":"IFERROR(GJ_Tot_17_18,0)","v":0},{"$f":"GJTotRef_Ajust_17_18","v":0},{"$f":"CAD_Tot_17_18","v":0},{"$f":"IF(ISERROR(GJ_Tot_17_18/O18),0,(GJ_Tot_17_18/O18))","v":0},{"$f":"IF(ISERROR(GJTotRef_Ajust_17_18/O18),0,(GJTotRef_Ajust_17_18/O18))","v":0},{"$f":"IF(ISERROR(CAD_Tot_17_18/O18),0,(CAD_Tot_17_18/O18))","v":0},{"$f":"GES_ton_17_18","v":0},{"$f":"IF(ISERROR(GES_ton_17_18/O18),0,(GES_ton_17_18/O18))*1000","v":0},0,0,0,0,{"$f":"GES_ton_09_10-GES_ton_17_18","v":0},{"$f":"IF(ISERROR(Sup_17_18),0,(Sup_17_18))","v":0},{"$f":"nb_bât_17_18","v":0},{"$f":"Elec_kWh_17_18","v":0},{"$f":"Elec_CAD_17_18","v":0},{"$f":"GN_m³_17_18","v":0},{"$f":"GN_CAD_17_18","v":0},{"$f":"Ma2_l_17_18","v":0},{"$f":"Ma2_CAD_17_18","v":0},{"$f":"Ma6_l_17_18","v":0},{"$f":"Ma6_CAD_17_18","v":0},{"$f":"Dies_17_18","v":0},{"$f":"Dies_CAD_17_18","v":0},{"$f":"Prop_l_17_18","v":0},{"$f":"Prop_CAD_17_18","v":0},{"$f":"Bois20_1000kg_17_18","v":0},{"$f":"Bois20_CAD_17_18","v":0},{"$f":"Bois45_1000kg_17_18","v":0},{"$f":"Bois45_CAD_17_18","v":0},{"$f":"Vapeur_Lbs_17_18","v":0},{"$f":"Vapeur_CAD_17_18","v":0},{"$f":"EauRefroidie_MBTU_17_18","v":0},{"$f":"EauRefroidie_CAD_17_18","v":0},{"$f":"EauChaude_MBTU_17_18","v":0},{"$f":"EauChaude_CAD_17_18","v":0},{"$f":"DJC_tot_17_18","v":3949.4000000000005},false,false,false,false,false]
["2018-2019",{"$f":"IFERROR(GJ_Tot_18_19,0)","v":0},{"$f":"GJTotRef_Ajust_18_19","v":0},{"$f":"CAD_Tot_18_19","v":0},{"$f":"IF(ISERROR(GJ_Tot_18_19/O19),0,(GJ_Tot_18_19/O19))","v":0},{"$f":"IF(ISERROR(GJTotRef_Ajust_18_19/O19),0,(GJTotRef_Ajust_18_19/O19))","v":0},{"$f":"IF(ISERROR(CAD_Tot_18_19/O19),0,(CAD_Tot_18_19/O19))","v":0},{"$f":"GES_ton_18_19","v":0},{"$f":"IF(ISERROR(GES_ton_18_19/O19),0,(GES_ton_18_19/O19))*1000","v":0},0,0,0,0,{"$f":"GES_ton_09_10-GES_ton_18_19","v":0},{"$f":"IF(ISERROR(Sup_18_19),0,(Sup_18_19))","v":0},{"$f":"nb_bât_18_19","v":0},{"$f":"Elec_kWh_18_19","v":0},{"$f":"Elec_CAD_18_19","v":0},{"$f":"GN_m³_18_19","v":0},{"$f":"GN_CAD_18_19","v":0},{"$f":"Ma2_l_18_19","v":0},{"$f":"Ma2_CAD_18_19","v":0},{"$f":"Ma6_l_18_19","v":0},{"$f":"Ma6_CAD_18_19","v":0},{"$f":"Dies_18_19","v":0},{"$f":"Dies_CAD_18_19","v":0},{"$f":"Prop_l_18_19","v":0},{"$f":"Prop_CAD_18_19","v":0},{"$f":"Bois20_1000kg_18_19","v":0},{"$f":"Bois20_CAD_18_19","v":0},{"$f":"Bois45_1000kg_18_19","v":0},{"$f":"Bois45_CAD_18_19","v":0},{"$f":"Vapeur_Lbs_18_19","v":0},{"$f":"Vapeur_CAD_18_19","v":0},{"$f":"EauRefroidie_MBTU_18_19","v":0},{"$f":"EauRefroidie_CAD_18_19","v":0},{"$f":"EauChaude_MBTU_18_19","v":0},{"$f":"EauChaude_CAD_18_19","v":0},{"$f":"DJC_tot_18_19","v":4347.2000000000007},false,false,false,false,false]
["2019-2020",{"$f":"IFERROR(GJ_Tot_19_20,0)","v":0},{"$f":"GJTotRef_Ajust_19_20","v":0},{"$f":"CAD_Tot_19_20","v":0},{"$f":"IF(ISERROR(GJ_Tot_19_20/O20),0,(GJ_Tot_19_20/O20))","v":0},{"$f":"IF(ISERROR(GJTotRef_Ajust_19_20/O20),0,(GJTotRef_Ajust_19_20/O20))","v":0},{"$f":"IF(ISERROR(CAD_Tot_19_20/O20),0,(CAD_Tot_19_20/O20))","v":0},{"$f":"GES_ton_19_20","v":0},{"$f":"IF(ISERROR(GES_ton_19_20/O20),0,(GES_ton_19_20/O20))*1000","v":0},0,0,0,0,{"$f":"GES_ton_09_10-GES_ton_19_20","v":0},{"$f":"IF(ISERROR(Sup_19_20),0,(Sup_19_20))","v":0},{"$f":"nb_bât_19_20","v":0},{"$f":"Elec_kWh_19_20","v":0},{"$f":"Elec_CAD_19_20","v":0},{"$f":"GN_m³_19_20","v":0},{"$f":"GN_CAD_19_20","v":0},{"$f":"Ma2_l_19_20","v":0},{"$f":"Ma2_CAD_19_20","v":0},{"$f":"Ma6_l_19_20","v":0},{"$f":"Ma6_CAD_19_20","v":0},{"$f":"Dies_19_20","v":0},{"$f":"Dies_CAD_19_20","v":0},{"$f":"Prop_l_19_20","v":0},{"$f":"Prop_CAD_19_20","v":0},{"$f":"Bois20_1000kg_19_20","v":0},{"$f":"Bois20_CAD_19_20","v":0},{"$f":"Bois45_1000kg_19_20","v":0},{"$f":"Bois45_CAD_19_20","v":0},{"$f":"Vapeur_Lbs_19_20","v":0},{"$f":"Vapeur_CAD_19_20","v":0},{"$f":"EauRefroidie_MBTU_19_20","v":0},{"$f":"EauRefroidie_CAD_19_20","v":0},{"$f":"EauChaude_MBTU_19_20","v":0},{"$f":"EauChaude_CAD_19_20","v":0},{"$f":"DJC_tot_19_20","v":4105.7},false,false,false,false,false]
[{"$f":"'1. IDENTITÉ'!A66","v":"2020-2021"},{"$f":"IFERROR(GJ_Tot_20_21,0)","v":0},{"$f":"GJTotRef_Ajust_20_21","v":0},{"$f":"CAD_Tot_20_21","v":0},{"$f":"IF(ISERROR(GJ_Tot_20_21/O21),0,(GJ_Tot_20_21/O21))","v":0},{"$f":"IF(ISERROR(GJTotRef_Ajust_20_21/O21),0,(GJTotRef_Ajust_20_21/O21))","v":0},{"$f":"IF(ISERROR(CAD_Tot_20_21/O21),0,(CAD_Tot_20_21/O21))","v":0},{"$f":"GES_ton_20_21","v":{"$error":"#NAME?"}},{"$f":"IF(ISERROR(GES_ton_20_21/O21),0,(GES_ton_20_21/O21))*1000","v":0},0,0,0,0,{"$f":"GES_ton_09_10-GES_ton_20_21","v":{"$error":"#NAME?"}},{"$f":"IF(ISERROR(Sup_20_21),0,(Sup_20_21))","v":0},{"$f":"nb_bât_20_21","v":0},{"$f":"Elec_kWh_20_21","v":0},{"$f":"Elec_CAD_20_21","v":0},{"$f":"GN_m³_20_21","v":0},{"$f":"GN_CAD_20_21","v":0},{"$f":"Ma2_l_20_21","v":0},{"$f":"Ma2_CAD_20_21","v":0},{"$f":"Ma6_l_20_21","v":0},{"$f":"Ma6_CAD_20_21","v":0},{"$f":"Dies_20_21","v":0},{"$f":"Dies_CAD_20_21","v":0},{"$f":"Prop_l_20_21","v":0},{"$f":"Prop_CAD_20_21","v":0},{"$f":"Bois20_1000kg_20_21","v":0},{"$f":"Bois20_CAD_20_21","v":0},{"$f":"Bois45_1000kg_20_21","v":0},{"$f":"Bois45_CAD_20_21","v":0},{"$f":"Vapeur_Lbs_20_21","v":0},{"$f":"Vapeur_CAD_20_21","v":0},{"$f":"EauRefroidie_MBTU_20_21","v":0},{"$f":"EauRefroidie_CAD_20_21","v":0},{"$f":"EauChaude_MBTU_20_21","v":0},{"$f":"EauChaude_CAD_20_21","v":0},{"$f":"DJC_tot_20_21","v":998.40000000000009},false,false,false,false,false]
[{"$f":"'1. IDENTITÉ'!A67","v":"2021-2022"},0,0,0,0,0,0,{"$error":"#NAME?"},0,{"$f":"IF(ISERROR(F22-E22),0,(F22-E22))","v":0},{"$f":"IF(ISERROR(1-E22/F22),0,(1-E22/F22))","v":0},{"$f":"IF(ISERROR($G$10-G22),0,($G$10-G22))","v":0},{"$f":"IF(ISERROR(1-G22/$G$12),0,(1-G22/$G$12))","v":0},{"$error":"#NAME?"},0,0,0,0,0,0,0,0,0,0,null,null,0,0,0,0,0,0,0,0,0,0,0,0,998.40000000000009,false,false,false,false,false]
[{"$f":"'1. IDENTITÉ'!A68","v":"2022-2023"},0,0,0,0,0,0,{"$error":"#NAME?"},0,0,0,0,0,{"$error":"#NAME?"},0,0,0,0,0,0,0,0,0,0,null,null,0,0,0,0,0,0,0,0,0,0,0,0,998.40000000000009,false,false,false,false,false]
[{"$f":"'1. IDENTITÉ'!A69","v":"2023-2024"},0,0,0,0,0,0,{"$error":"#NAME?"},0,0,0,0,0,{"$error":"#NAME?"},0,0,0,0,0,0,0,0,0,0,null,null,0,0,0,0,0,0,0,0,0,0,0,0,998.40000000000009,false,false,false,false,false]
[{"$f":"'1. IDENTITÉ'!A70","v":"2024-2025"},0,0,0,0,0,0,{"$error":"#NAME?"},0,0,0,0,0,{"$error":"#NAME?"},0,0,0,0,0,0,0,0,0,0,null,null,0,0,0,0,0,0,0,0,0,0,0,0,998.40000000000009,false,false,false,false,false]
[{"$f":"'1. IDENTITÉ'!A71","v":"2025-2026"},0,0,0,0,0,0,{"$error":"#NAME?"},0,0,0,0,0,{"$error":"#NAME?"},0,0,0,0,0,0,0,0,0,0,null,null,0,0,0,0,0,0,0,0,0,0,0,0,998.40000000000009,false,false,false,false,false]
[{"$f":"'1. IDENTITÉ'!A72","v":"2026-2027"},0,0,0,0,0,0,{"$error":"#NAME?"},0,0,0,0,0,{"$error":"#NAME?"},0,0,0,0,0,0,0,0,0,0,null,null,0,0,0,0,0,0,0,0,0,0,0,0,998.40000000000009,false,false,false,false,false]
[{"$f":"'1. IDENTITÉ'!A73","v":"2027-2028"},0,0,0,0,0,0,{"$error":"#NAME?"},0,0,0,0,0,{"$error":"#NAME?"},0,0,0,0,0,0,0,0,0,0,null,null,0,0,0,0,0,0,0,0,0,0,0,0,998.40000000000009,false,false,false,false,false]
[{"$f":"'1. IDENTITÉ'!A74","v":"2028-2029"},0,0,0,0,0,0,{"$error":"#NAME?"},0,0,0,0,0,{"$error":"#NAME?"},0,0,0,0,0,0,0,0,0,0,null,null,0,0,0,0,0,0,0,0,0,0,0,0,998.40000000000009,false,false,false,false,false]
[{"$f":"'1. IDENTITÉ'!A75","v":"2029-2030"},0,0,0,0,0,0,{"$error":"#NAME?"},0,0,0,0,0,{"$error":"#NAME?"},0,0,0,0,0,0,0,0,0,0,null,null,0,0,0,0,0,0,0,0,0,0,0,0,998.40000000000009,false,false,false,false,false]
[]
[]
[]
[]
[]
[]
[]
[]
[]
[]
[]
[]
[]
[1,{"$f":"GJ_Tot_05_06","v":{"$error":"#REF!"}},null,{"$f":"CAD_Tot_05_06","v":{"$error":"#REF!"}},{"$f":"GJm²_05_06","v":{"$error":"#REF!"}},null,{"$f":"CAD_m²_05_06","v":{"$error":"#REF!"}},{"$f":"GES_ton_05_06","v":{"$error":"#REF!"}},{"$f":"GES_ton_m²_05_06","v":{"$error":"#REF!"}},null,null,null,null,null,{"$f":"Sup_05_06","v":{"$error":"#REF!"}},null,{"$f":"Elec_kWh_05_06","v":{"$error":"#REF!"}},{"$f":"Elec_CAD_05_06","v":{"$error":"#REF!"}},{"$f":"GN_m³_05_06","v":{"$error":"#REF!"}},{"$f":"GN_CAD_05_06","v":{"$error":"#REF!"}},{"$f":"Ma2_l_05_06","v":{"$error":"#REF!"}},{"$f":"Ma2_CAD_05_06","v":{"$error":"#REF!"}},{"$f":"Ma6_l_05_06","v":{"$error":"#REF!"}},{"$f":"Ma6_CAD_05_06","v":{"$error":"#REF!"}},null,null,{"$f":"Prop_l_05_06","v":{"$error":"#REF!"}},{"$f":"Prop_CAD_05_06","v":{"$error":"#REF!"}},{"$f":"Bois20_1000kg_05_06","v":{"$error":"#REF!"}},{"$f":"Bois20_CAD_05_06","v":{"$error":"#REF!"}},{"$f":"Bois45_1000kg_05_06","v":{"$error":"#REF!"}},{"$f":"Bois45_CAD_05_06","v":{"$error":"#REF!"}},null,null,null,null,null,null,{"$f":"DJC_tot_05_06","v":{"$error":"#REF!"}}]
[2,{"$f":"GJ_Tot_06_07","v":{"$error":"#REF!"}},null,{"$f":"CAD_Tot_06_07","v":{"$error":"#REF!"}},{"$f":"GJm²_06_07","v":{"$error":"#REF!"}},null,{"$f":"CAD_m²_06_07","v":{"$error":"#REF!"}},{"$f":"GES_ton_06_07","v":{"$error":"#REF!"}},{"$f":"GES_ton_m²_06_07","v":{"$error":"#REF!"}},null,null,null,null,null,{"$f":"Sup_06_07","v":{"$error":"#REF!"}},null,{"$f":"Elec_kWh_06_07","v":{"$error":"#REF!"}},{"$f":"Elec_CAD_06_07","v":{"$error":"#REF!"}},{"$f":"GN_m³_06_07","v":{"$error":"#REF!"}},{"$f":"GN_CAD_06_07","v":{"$error":"#REF!"}},{"$f":"Ma2_l_06_07","v":{"$error":"#REF!"}},{"$f":"Ma2_CAD_06_07","v":{"$error":"#REF!"}},{"$f":"Ma6_l_06_07","v":{"$error":"#REF!"}},{"$f":"Ma6_CAD_06_07","v":{"$error":"#REF!"}},null,null,{"$f":"Prop_l_06_07","v":{"$error":"#REF!"}},{"$f":"Prop_CAD_06_07","v":{"$error":"#REF!"}},{"$f":"Bois20_1000kg_06_07","v":{"$error":"#REF!"}},{"$f":"Bois20_CAD_06_07","v":{"$error":"#REF!"}},{"$f":"Bois45_1000kg_06_07","v":{"$error":"#REF!"}},{"$f":"Bois45_CAD_06_07","v":{"$error":"#REF!"}},null,null,null,null,null,null,{"$f":"DJC_tot_06_07","v":{"$error":"#REF!"}}]
[3,{"$f":"GJ_Tot_07_08","v":{"$error":"#REF!"}},null,{"$f":"CAD_Tot_07_08","v":{"$error":"#REF!"}},{"$f":"GJm²_07_08","v":{"$error":"#REF!"}},null,{"$f":"CAD_m²_07_08","v":{"$error":"#REF!"}},{"$f":"GES_ton_07_08","v":{"$error":"#REF!"}},{"$f":"GES_ton_m²_07_08","v":{"$error":"#REF!"}},null,null,null,null,null,{"$f":"Sup_07_08","v":{"$error":"#REF!"}},null,{"$f":"Elec_kWh_07_08","v":{"$error":"#REF!"}},{"$f":"Elec_CAD_07_08","v":{"$error":"#REF!"}},{"$f":"GN_m³_07_08","v":{"$error":"#REF!"}},{"$f":"GN_CAD_07_08","v":{"$error":"#REF!"}},{"$f":"Ma2_l_07_08","v":{"$error":"#REF!"}},{"$f":"Ma2_CAD_07_08","v":{"$error":"#REF!"}},{"$f":"Ma6_l_07_08","v":{"$error":"#REF!"}},{"$f":"Ma6_CAD_07_08","v":{"$error":"#REF!"}},null,null,{"$f":"Prop_l_07_08","v":{"$error":"#REF!"}},{"$f":"Prop_CAD_07_08","v":{"$error":"#REF!"}},{"$f":"Bois20_1000kg_07_08","v":{"$error":"#REF!"}},{"$f":"Bois20_CAD_07_08","v":{"$error":"#REF!"}},{"$f":"Bois45_1000kg_07_08","v":{"$error":"#REF!"}},{"$f":"Bois45_CAD_07_08","v":{"$error":"#REF!"}},null,null,null,null,null,null,{"$f":"DJC_tot_07_08","v":{"$error":"#REF!"}}]
[4,{"$f":"GJ_Tot_08_09","v":{"$error":"#REF!"}},null,{"$f":"CAD_Tot_08_09","v":{"$error":"#REF!"}},{"$f":"GJm²_08_09","v":{"$error":"#REF!"}},null,{"$f":"CAD_m²_08_09","v":{"$error":"#REF!"}},{"$f":"GES_ton_08_09","v":{"$error":"#REF!"}},{"$f":"GES_ton_m²_08_09","v":{"$error":"#REF!"}},null,null,null,null,null,{"$f":"Sup_08_09","v":{"$error":"#REF!"}},null,{"$f":"Elec_kWh_08_09","v":{"$error":"#REF!"}},{"$f":"Elec_CAD_08_09","v":{"$error":"#REF!"}},{"$f":"GN_m³_08_09","v":{"$error":"#REF!"}},{"$f":"GN_CAD_08_09","v":{"$error":"#REF!"}},{"$f":"Ma2_l_08_09","v":{"$error":"#REF!"}},{"$f":"Ma2_CAD_08_09","v":{"$error":"#REF!"}},{"$f":"Ma6_l_08_09","v":{"$error":"#REF!"}},{"$f":"Ma6_CAD_08_09","v":{"$error":"#REF!"}},null,null,{"$f":"Prop_l_08_09","v":{"$error":"#REF!"}},{"$f":"Prop_CAD_08_09","v":{"$error":"#REF!"}},{"$f":"Bois20_1000kg_08_09","v":{"$error":"#REF!"}},{"$f":"Bois20_CAD_08_09","v":{"$error":"#REF!"}},{"$f":"Bois45_1000kg_08_09","v":{"$error":"#REF!"}},{"$f":"Bois45_CAD_08_09","v":{"$error":"#REF!"}},null,null,null,null,null,null,{"$f":"DJC_tot_08_09","v":{"$error":"#REF!"}}]
[5,{"$f":"GJ_Tot_09_10","v":0},null,{"$f":"CAD_Tot_09_10","v":0},{"$f":"GJm²_09_10","v":""},null,{"$f":"CAD_m²_09_10","v":""},{"$f":"GES_ton_09_10","v":0},{"$f":"GES_ton_m²_09_10","v":0},null,null,null,null,null,{"$f":"Sup_09_10","v":0},null,{"$f":"Elec_kWh_09_10","v":0},{"$f":"Elec_CAD_09_10","v":0},{"$f":"GN_m³_09_10","v":0},{"$f":"GN_CAD_09_10","v":0},{"$f":"Ma2_l_09_10","v":0},{"$f":"Ma2_CAD_09_10","v":0},{"$f":"Ma6_l_09_10","v":0},{"$f":"Ma6_CAD_09_10","v":0},null,null,{"$f":"Prop_l_09_10","v":0},{"$f":"Prop_CAD_09_10","v":0},{"$f":"Bois20_1000kg_09_10","v":0},{"$f":"Bois20_CAD_09_10","v":0},{"$f":"Bois45_1000kg_09_10","v":0},{"$f":"Bois45_CAD_09_10","v":0},null,null,null,null,null,null,{"$f":"DJC_tot_09_10","v":3967.8000000000006}]
[6,{"$f":"GJ_Tot_10_11","v":0},null,{"$f":"CAD_Tot_10_11","v":0},{"$f":"GJm²_10_11","v":""},null,{"$f":"CAD_m²_10_11","v":""},{"$f":"GES_ton_10_11","v":0},{"$f":"GES_ton_m²_10_11","v":0},null,null,null,null,null,{"$f":"Sup_10_11","v":0},null,{"$f":"Elec_kWh_10_11","v":0},{"$f":"Elec_CAD_10_11","v":0},{"$f":"GN_m³_10_11","v":0},{"$f":"GN_CAD_10_11","v":0},{"$f":"Ma2_l_10_11","v":0},{"$f":"Ma2_CAD_10_11","v":0},{"$f":"Ma6_l_10_11","v":0},{"$f":"Ma6_CAD_10_11","v":0},null,null,{"$f":"Prop_l_10_11","v":0},{"$f":"Prop_CAD_10_11","v":0},{"$f":"Bois20_1000kg_10_11","v":0},{"$f":"Bois20_CAD_10_11","v":0},{"$f":"Bois45_1000kg_10_11","v":0},{"$f":"Bois45_CAD_10_11","v":0},null,null,null,null,null,null,{"$f":"DJC_tot_10_11","v":4187.3999999999996}]
[7,{"$f":"GJ_Tot_11_12","v":0},{"$f":"GJTotRef_Ajust_11_12","v":0},{"$f":"CAD_Tot_11_12","v":0},{"$f":"GJm²_11_12","v":""},{"$f":"GJTotRef_Ajust_11_12","v":0},{"$f":"CAD_m²_11_12","v":""},{"$f":"GES_ton_11_12","v":0},{"$f":"GES_ton_m²_11_12","v":0},null,null,null,null,{"$f":"GES_ton_10_11-GES_ton_11_12","v":0},{"$f":"Sup_11_12","v":0},null,{"$f":"Elec_kWh_11_12","v":0},{"$f":"Elec_CAD_11_12","v":0},{"$f":"GN_m³_11_12","v":0},{"$f":"GN_CAD_11_12","v":0},{"$f":"Ma2_l_11_12","v":0},{"$f":"Ma2_CAD_11_12","v":0},{"$f":"Ma6_l_11_12","v":0},{"$f":"Ma6_CAD_11_12","v":0},null,null,{"$f":"Prop_l_11_12","v":0},{"$f":"Prop_CAD_11_12","v":0},{"$f":"Bois20_1000kg_11_12","v":0},{"$f":"Bois20_CAD_11_12","v":0},{"$f":"Bois45_1000kg_11_12","v":0},{"$f":"Bois45_CAD_11_12","v":0},null,null,null,null,null,null,{"$f":"DJC_tot_11_12","v":3730}]
[8,{"$f":"GJ_Tot_12_13","v":0},{"$f":"GJTotRef_Ajust_12_13","v":0},{"$f":"CAD_Tot_12_13","v":0},{"$f":"GJm²_12_13","v":""},{"$f":"GJTotRef_Ajust_12_13","v":0},{"$f":"CAD_m²_12_13","v":""},{"$f":"GES_ton_12_13","v":0},{"$f":"GES_ton_m²_12_13","v":0},null,null,null,null,{"$f":"GES_ton_10_11-GES_ton_12_13","v":0},{"$f":"Sup_12_13","v":0},null,{"$f":"Elec_kWh_12_13","v":0},{"$f":"Elec_CAD_12_13","v":0},{"$f":"GN_m³_12_13","v":0},{"$f":"GN_CAD_12_13","v":0},{"$f":"Ma2_l_12_13","v":0},{"$f":"Ma2_CAD_12_13","v":0},{"$f":"Ma6_l_12_13","v":0},{"$f":"Ma6_CAD_12_13","v":0},null,null,{"$f":"Prop_l_12_13","v":0},{"$f":"Prop_CAD_12_13","v":0},{"$f":"Bois20_1000kg_12_13","v":0},{"$f":"Bois20_CAD_12_13","v":0},{"$f":"Bois45_1000kg_12_13","v":0},{"$f":"Bois45_CAD_12_13","v":0},null,null,null,null,null,null,{"$f":"DJC_tot_12_13","v":4039.4}]
[9,{"$f":"GJ_Tot_13_14","v":0},{"$f":"GJTotRef_Ajust_13_14","v":0},{"$f":"CAD_Tot_13_14","v":0},{"$f":"GJm²_13_14","v":""},{"$f":"GJTotRef_Ajust_13_14","v":0},{"$f":"CAD_m²_13_14","v":""},{"$f":"GES_ton_13_14","v":0},{"$f":"GES_ton_m²_13_14","v":0},null,null,null,null,{"$f":"GES_ton_10_11-GES_ton_13_14","v":0},{"$f":"Sup_13_14","v":0},null,{"$f":"Elec_kWh_13_14","v":0},{"$f":"Elec_CAD_13_14","v":0},{"$f":"GN_m³_13_14","v":0},{"$f":"GN_CAD_13_14","v":0},{"$f":"Ma2_l_13_14","v":0},{"$f":"Ma2_CAD_13_14","v":0},{"$f":"Ma6_l_13_14","v":0},{"$f":"Ma6_CAD_13_14","v":0},null,null,{"$f":"Prop_l_13_14","v":0},{"$f":"Prop_CAD_13_14","v":0},{"$f":"Bois20_1000kg_13_14","v":0},{"$f":"Bois20_CAD_13_14","v":0},{"$f":"Bois45_1000kg_13_14","v":0},{"$f":"Bois45_CAD_13_14","v":0},null,null,null,null,null,null,{"$f":"DJC_tot_13_14","v":4562.5}]
[10,{"$f":"GJ_Tot_14_15","v":0},{"$f":"GJTotRef_Ajust_14_15","v":0},{"$f":"CAD_Tot_14_15","v":0},{"$f":"GJm²_14_15","v":""},{"$f":"GJTotRef_Ajust_14_15","v":0},{"$f":"CAD_m²_14_15","v":""},{"$f":"GES_ton_14_15","v":0},{"$f":"GES_ton_m²_14_15","v":0},null,null,null,null,{"$f":"GES_ton_10_11-GES_ton_14_15","v":0},{"$f":"Sup_14_15","v":0},null,{"$f":"Elec_kWh_14_15","v":0},{"$f":"Elec_CAD_14_15","v":0},{"$f":"GN_m³_14_15","v":0},{"$f":"GN_CAD_14_15","v":0},{"$f":"Ma2_l_14_15","v":0},{"$f":"Ma2_CAD_14_15","v":0},{"$f":"Ma6_l_14_15","v":0},{"$f":"Ma6_CAD_14_15","v":0},null,null,{"$f":"Prop_l_14_15","v":0},{"$f":"Prop_CAD_14_15","v":0},{"$f":"Bois20_1000kg_14_15","v":0},{"$f":"Bois20_CAD_14_15","v":0},{"$f":"Bois45_1000kg_14_15","v":0},{"$f":"Bois45_CAD_14_15","v":0},null,null,null,null,null,null,{"$f":"DJC_tot_14_15","v":4543.1000000000004}]
[11,{"$f":"GJ_Tot_15_16","v":0},{"$f":"GJTotRef_Ajust_15_16","v":0},{"$f":"CAD_Tot_15_16","v":0},{"$f":"GJm²_15_16","v":""},{"$f":"GJTotRef_Ajust_15_16","v":0},{"$f":"CAD_m²_15_16","v":""},{"$f":"GES_ton_15_16","v":0},{"$f":"GES_ton_m²_15_16","v":0},null,null,null,null,{"$f":"GES_ton_10_11-GES_ton_15_16","v":0},{"$f":"Sup_15_16","v":0},null,{"$f":"Elec_kWh_15_16","v":0},{"$f":"Elec_CAD_15_16","v":0},{"$f":"GN_m³_15_16","v":0},{"$f":"GN_CAD_15_16","v":0},{"$f":"Ma2_l_15_16","v":0},{"$f":"Ma2_CAD_15_16","v":0},{"$f":"Ma6_l_15_16","v":0},{"$f":"Ma6_CAD_15_16","v":0},null,null,{"$f":"Prop_l_15_16","v":0},{"$f":"Prop_CAD_15_16","v":0},{"$f":"Bois20_1000kg_15_16","v":0},{"$f":"Bois20_CAD_15_16","v":0},{"$f":"Bois45_1000kg_15_16","v":0},{"$f":"Bois45_CAD_15_16","v":0},null,null,null,null,null,null,{"$f":"DJC_tot_15_16","v":3611.4000000000005}]
[12,{"$f":"GJ_Tot_16_17","v":0},{"$f":"GJTotRef_Ajust_16_17","v":0},{"$f":"CAD_Tot_16_17","v":0},{"$f":"GJm²_16_17","v":""},{"$f":"GJTotRef_Ajust_16_17","v":0},{"$f":"CAD_m²_16_17","v":""},{"$f":"GES_ton_16_17","v":0},{"$f":"GES_ton_m²_16_17","v":0},null,null,null,null,{"$f":"GES_ton_10_11-GES_ton_16_17","v":0},{"$f":"Sup_16_17","v":0},null,{"$f":"Elec_kWh_16_17","v":0},{"$f":"Elec_CAD_16_17","v":0},{"$f":"GN_m³_16_17","v":0},{"$f":"GN_CAD_16_17","v":0},{"$f":"Ma2_l_16_17","v":0},{"$f":"Ma2_CAD_16_17","v":0},{"$f":"Ma6_l_16_17","v":0},{"$f":"Ma6_CAD_16_17","v":0},null,null,{"$f":"Prop_l_16_17","v":0},{"$f":"Prop_CAD_16_17","v":0},{"$f":"Bois20_1000kg_16_17","v":0},{"$f":"Bois20_CAD_16_17","v":0},{"$f":"Bois45_1000kg_16_17","v":0},{"$f":"Bois45_CAD_16_17","v":0},null,null,null,null,null,null,{"$f":"DJC_tot_16_17","v":3951.9}]
[13,{"$f":"GJ_Tot_17_18","v":0},{"$f":"GJTotRef_Ajust_17_18","v":0},{"$f":"CAD_Tot_17_18","v":0},{"$f":"GJm²_17_18","v":""},{"$f":"GJTotRef_Ajust_17_18","v":0},{"$f":"CAD_m²_17_18","v":""},{"$f":"GES_ton_17_18","v":0},{"$f":"GES_ton_m²_17_18","v":0},null,null,null,null,{"$f":"GES_ton_10_11-GES_ton_17_18","v":0},{"$f":"Sup_17_18","v":0},null,{"$f":"Elec_kWh_17_18","v":0},{"$f":"Elec_CAD_17_18","v":0},{"$f":"GN_m³_17_18","v":0},{"$f":"GN_CAD_17_18","v":0},{"$f":"Ma2_l_17_18","v":0},{"$f":"Ma2_CAD_17_18","v":0},{"$f":"Ma6_l_17_18","v":0},{"$f":"Ma6_CAD_17_18","v":0},null,null,{"$f":"Prop_l_17_18","v":0},{"$f":"Prop_CAD_17_18","v":0},{"$f":"Bois20_1000kg_17_18","v":0},{"$f":"Bois20_CAD_17_18","v":0},{"$f":"Bois45_1000kg_17_18","v":0},{"$f":"Bois45_CAD_17_18","v":0},null,null,null,null,null,null,{"$f":"DJC_tot_17_18","v":3949.4000000000005}]
[14,{"$f":"GJ_Tot_18_19","v":0},{"$f":"GJTotRef_Ajust_18_19","v":0},{"$f":"CAD_Tot_18_19","v":0},{"$f":"GJm²_18_19","v":""},{"$f":"GJTotRef_Ajust_18_19","v":0},{"$f":"CAD_m²_18_19","v":""},{"$f":"GES_ton_18_19","v":0},{"$f":"GES_ton_m²_18_19","v":0},null,null,null,null,{"$f":"GES_ton_10_11-GES_ton_18_19","v":0},{"$f":"Sup_18_19","v":0},null,{"$f":"Elec_kWh_18_19","v":0},{"$f":"Elec_CAD_18_19","v":0},{"$f":"GN_m³_18_19","v":0},{"$f":"GN_CAD_18_19","v":0},{"$f":"Ma2_l_18_19","v":0},{"$f":"Ma2_CAD_18_19","v":0},{"$f":"Ma6_l_18_19","v":0},{"$f":"Ma6_CAD_18_19","v":0},null,null,{"$f":"Prop_l_18_19","v":0},{"$f":"Prop_CAD_18_19","v":0},{"$f":"Bois20_1000kg_18_19","v":0},{"$f":"Bois20_CAD_18_19","v":0},{"$f":"Bois45_1000kg_18_19","v":0},{"$f":"Bois45_CAD_18_19","v":0},null,null,null,null,null,null,{"$f":"DJC_tot_18_19","v":4347.2000000000007}]
[15,{"$f":"GJ_Tot_19_20","v":0},{"$f":"GJTotRef_Ajust_19_20","v":0},{"$f":"CAD_Tot_19_20","v":0},{"$f":"GJm²_19_20","v":""},{"$f":"GJTotRef_Ajust_19_20","v":0},{"$f":"CAD_m²_19_20","v":""},{"$f":"GES_ton_19_20","v":0},{"$f":"GES_ton_m²_19_20","v":0},null,null,null,null,{"$f":"GES_ton_10_11-GES_ton_19_20","v":0},{"$f":"Sup_19_20","v":0},{"$f":"Sup_19_20","v":0},{"$f":"Elec_kWh_19_20","v":0},{"$f":"Elec_CAD_19_20","v":0},{"$f":"GN_m³_19_20","v":0},{"$f":"GN_CAD_19_20","v":0},{"$f":"Ma2_l_19_20","v":0},{"$f":"Ma2_CAD_19_20","v":0},{"$f":"Ma6_l_19_20","v":0},{"$f":"Ma6_CAD_19_20","v":0},null,null,{"$f":"Prop_l_19_20","v":0},{"$f":"Prop_CAD_19_20","v":0},{"$f":"Bois20_1000kg_19_20","v":0},{"$f":"Bois20_CAD_19_20","v":0},{"$f":"Bois45_1000kg_19_20","v":0},{"$f":"Bois45_CAD_19_20","v":0},null,null,null,null,null,null,{"$f":"DJC_tot_19_20","v":4105.7}]
[16,{"$f":"GJ_Tot_20_21","v":0},{"$f":"GJTotRef_Ajust_20_21","v":0},{"$f":"CAD_Tot_20_21","v":0},{"$f":"GJm²_20_21","v":""},{"$f":"GJTotRef_Ajust_20_21","v":0},{"$f":"CAD_m²_20_21","v":""},{"$f":"GES_ton_20_21","v":{"$error":"#NAME?"}},{"$f":"GES_ton_m²_20_21","v":0},null,null,null,null,{"$f":"GES_ton_10_11-GES_ton_20_21","v":{"$error":"#NAME?"}},{"$f":"Sup_20_21","v":0},{"$f":"Sup_20_21","v":0},{"$f":"Elec_kWh_20_21","v":0},{"$f":"Elec_CAD_20_21","v":0},{"$f":"GN_m³_20_21","v":0},{"$f":"GN_CAD_20_21","v":0},{"$f":"Ma2_l_20_21","v":0},{"$f":"Ma2_CAD_20_21","v":0},{"$f":"Ma6_l_20_21","v":0},{"$f":"Ma6_CAD_20_21","v":0},null,null,{"$f":"Prop_l_20_21","v":0},{"$f":"Prop_CAD_20_21","v":0},{"$f":"Bois20_1000kg_20_21","v":0},{"$f":"Bois20_CAD_20_21","v":0},{"$f":"Bois45_1000kg_20_21","v":0},{"$f":"Bois45_CAD_20_21","v":0},null,null,null,null,null,null,{"$f":"DJC_tot_20_21","v":998.40000000000009}]
[]
[]
[]
[]
[]
[]
[]
[]
[{"$f":"VLOOKUP(I2,B2:N2002,11,FALSE)","v":{"$error":"#N/A"}}]

{"sheet":"ListeMO","index":16,"n_rows":129,"n_cols":3,"rows_kept":129,"cut":false,"hidden":true,"merged":[[0,1,0,2]]}
[null,"Liste des ministères et organismes"]
[null,"NOM DE L'ENTITÉ","NUMÉRO\nAPPARENTÉ\nSAGIR"]
[null,"Agence du revenu du Québec","0445"]
[null,"Autorité des marchés financiers","0356"]
[null,"Autorité des marchés publics","0395"]
[null,"Bibliothèque et Archives nationales du Québec","0326"]
[null,"Bureau d'audiences publiques sur l'environnement","0256"]
[null,"Bureau du coroner","0293"]
[null,"Bureau du forestier en chef","NA"]
[null,"Caisse de dépôt et placement du Québec et filiales","0603"]
[null,"Capital financière agricole inc.","0899"]
[null,"Centre de la francophonie des Amériques","0222"]
[null,"Centre de recherche industrielle du Québec","0523"]
[null,"Centre de services partagés du Québec","0347"]
[null,"Centre régional de santé et de services sociaux de la Baie-James","4051"]
[null,"Comité consultatif de lutte contre la pauvreté et l'exclusion sociale","0201"]
[null,"Comité de déontologie policière","0402"]
[null,"Comité d'examen (COMEX) (Convention de la Baie-James et du Nord québécois)","NA"]
[null,"Commissaire à la déontologie policière","0267"]
[null,"Commissaire à la lutte contre la corruption","0244"]
[null,"Commission d'accès à l'information","0408"]
[null,"Commission de la capitale nationale du Québec","0549"]
[null,"Commission de la construction du Québec","0509"]
[null,"Commission de la fonction publique du Québec","0430"]
[null,"Commission de la qualité de l'environnement Kativik","0486"]
[null,"Commission de protection du territoire agricole du Québec","0328"]
[null,"Commission de toponymie du Québec","0361"]
[null,"Commission des droits de la personne et des droits de la jeunesse","0271"]
[null,"Commission des normes, de l'équité, de la santé et de la sécurité du travail","0703"]
[null,"Commission des partenaires du marché du travail","0310"]
[null,"Commission des services juridiques","0315"]
[null,"Commission des transports du Québec","0830"]
[null,"Commission d'évaluation de l'enseignement collégial","0274"]
[null,"Commission municipale du Québec","0368"]
[null,"Commission québécoise des libérations conditionnelles","0425"]
[null,"Conseil Cris-Québec sur la foresterie","0203"]
[null,"Conseil de gestion de l'assurance parentale","0505"]
[null,"Conseil de la justice administrative","0272"]
[null,"Conseil des appellations réservées et des termes valorisants","0212"]
[null,"Conseil des arts et des lettres du Québec","0314"]
[null,"Conseil du patrimoine culturel du Québec","0206"]
[null,"Conseil du statut de la femme","0660"]
[null,"Conseil supérieur de la langue française","0690"]
[null,"Conseil supérieur de l'éducation","0238"]
[null,"Conservatoire de musique et d'art dramatique du Québec","0317"]
[null,"Corporation d'urgences-santé","0571"]
[null,"Curateur public du Québec","0560"]
[null,"Directeur des poursuites criminelles et pénales","0246"]
[null,"Directeur général des élections du Québec","0630"]
[null,"École nationale de police du Québec","0329"]
[null,"École nationale des pompiers du Québec","0335"]
[null,"Financement-Québec","0876"]
[null,"Financière agricole du Québec","0520"]
[null,"Fondation de la faune du Québec","0525"]
[null,"Fonds d'aide aux recours collectifs","0321"]
[null,"Fonds de la recherche du Québec – Nature et technologies","0327"]
[null,"Fonds de recherche du Québec - Santé","0324"]
[null,"Fonds de recherche du Québec - Société et culture","0318"]
[null,"Héma-Québec","0573"]
[null,"Hydro-Québec","0606"]
[null,"Institut de la statistique du Québec","0323"]
[null,"Institut de tourisme et d'hôtellerie du Québec","0547"]
[null,"Institut national de santé publique du Québec","0332"]
[null,"Institut national d'excellence en santé et en services sociaux","0357"]
[null,"Investissement Québec","0537"]
[null,"Ministère de la Culture et des Communications","0010"]
[null,"Ministère de la Famille","0065"]
[null,"Ministère de la justice","0400"]
[null,"Ministère de la Santé et des Services sociaux","0060"]
[null,"Ministère de la Sécurité publique","0095"]
[null,"Ministère de l'Agriculture, des Pêcheries et de l'Alimentation","0080"]
[null,"Ministère de l'Économie, de la Science et de l'Innovation","0280"]
[null,"Ministère de l'Éducation et de l'Enseignement supérieur","0350"]
[null,"Ministère de l'Immigration, de la Diversité et de l'Inclusion","0055"]
[null,"Ministère des Affaires municipales et de l'Occupation du territoire","0050"]
[null,"Ministère des Finances","0210"]
[null,"Ministère des Relations internationales et de la Francophonie","0030"]
[null,"Ministère des Ressources naturelles ","0600"]
[null,"Ministère des Transports, de la Mobilité durable et de l'Électrification des transports","0850"]
[null,"Ministère du Conseil exécutif","0140"]
[null,"Ministère du Développement durable, de l'Environnement et de la Lutte contre les changements climatiques","0380"]
[null,"Ministère du Tourisme","0071"]
[null,"Ministère du Travail, de l'Emploi et de la Solidarité sociale","0700"]
[null,"Musée d'art contemporain de Montréal","0541"]
[null,"Musée national des beaux-arts du Québec","0545"]
[null,"Musées de la civilisation","0544"]
[null,"Office de la protection du consommateur","0344"]
[null,"Office de la sécurité du revenu des chasseurs et piégeurs cris","0483"]
[null,"Office des personnes handicapées du Québec","0538"]
[null,"Office des professions du Québec","0360"]
[null,"Office Québec-Amériques pour la jeunesse ","0346"]
[null,"Office Québec-Monde pour la jeunesse","0239"]
[null,"Office québécois de la langue française","0710"]
[null,"Protecteur du citoyen","0295"]
[null,"Régie de l'assurance maladie du Québec","0064"]
[null,"Régie de l'énergie","0385"]
[null,"Régie des alcools, des courses et des jeux","0386"]
[null,"Régie des installations olympiques","0546"]
[null,"Régie des marchés agricoles et alimentaires du Québec","0392"]
[null,"Régie du bâtiment du Québec","0367"]
[null,"Régie du cinéma","0352"]
[null,"Régie du logement du Québec","0510"]
[null,"Régie régionale de la santé et des services sociaux du Nunavik","4017"]
[null,"Réseau de transport métropolitain","0553"]
[null,"Retraite Québec","0063"]
[null,"Secrétariat à la Capitale nationale","NA"]
[null,"Secrétariat du conseil du trésor","0160"]
[null,"Société de développement de la Baie-James","0618"]
[null,"Société de développement des entreprises culturelles","0539"]
[null,"Société de la Place de Arts de Montréal","0552"]
[null,"Société de l'assurance automobile du Québec","0320"]
[null,"Société de télédiffusion du Québec","0582"]
[null,"Société des Alcools du Québec","0624"]
[null,"Société des établissements de plein air du Québec","0569"]
[null,"Société des loteries du Québec","0627"]
[null,"Société des traversiers du Québec","0554"]
[null,"Société d'habitation du Québec","0730"]
[null,"Société du Centre des congrès de Québec","0557"]
[null,"Société du Grand Théâtre de Québec","0558"]
[null,"Société du Palais des congrès de Montréal","0559"]
[null,"Société du parc industriel et portuaire de Bécancour","0565"]
[null,"Société du Plan Nord","0376"]
[null,"Société québécoise de récupération et de recyclage","0586"]
[null,"Société québécoise des infrastructures","0339"]
[null,"Société québécoise d'information juridique","0585"]
[null,"Sûreté du Québec","0390"]
[null,"Tribunal administratif du Québec","0450"]
[null,"Tribunal administratif du travail","0415"]
[null,"Tribunal des droits de la personne","0434"]

{"sheet":"Transition","index":17,"n_rows":96,"n_cols":221,"rows_kept":96,"cut":false,"hidden":true,"merged":[[31,108,31,109],[31,8,31,9],[3,8,4,8],[3,11,4,11],[3,30,4,30],[31,2,31,4],[31,5,31,7],[31,16,31,17],[31,10,31,11]]}
[null,"Données bâtiments"]
[]
[null,"Code du MO","Année","Organisme","Ministère ou org.",null,null,null,"Parc de bâtiment","Superficie\nm2","Nb bâtiments","Parc de bâtiment","Catégorie","Intensité énerg. minimum","Intensité énerg. maximum",null,null,null,null,null,null,null,null,null,null,null,null,null,null,null,"Concatener (cette colonne est un repére de données pour les rapports personnalisés)",null,null,null,null,null,null,null,null,null,"propriété","location",null,null,"Nom pers. Respon.","Titre","Adresse","Ville","Téléphone","Courriel","Date","Année financière","Année de référence","Facteur consom. Variable"]
[null,"Code du MO","Année","Organisme\n(acronyme)","Ministère\nou organisme",null,null,null,"Parc de \nbâtiment","Superficie\nm2","Nombre de\nbâtiments","Parc de \nbâtiment","Catégorie","Intensité\nénergétique\nminimum","Intensité\nénergétique\nmaximum",null,null,null,null,null,null,null,null,null,null,null,null,null,null,null,"Concatener (cette colonne est un repére de données pour les rapports personnalisés)",null,null,null,null,null,null,null,null,null," Bâtiment",null,null,null,"Nom de la personne\nresponsable","Titre","Adresse","Ville","Téléphone","Courriel","Date","Année\nfinancière","Année\nde référence","Facteur de\nconsommation\nvariable"]
[null,null,null,null,null,null,null,null,null,null,null,null,null,null,null,null,null,null,null,null,null,null,null,null,null,null,null,null,null,null,null,null,null,null,null,null,null,null,null,null,"propriété","location"]
[]
[null,"Code du MO","Année","Organisme\n(acronyme)",{"$f":"'1. IDENTITÉ'!A10","v":"Ministère ou organisme :"},"Statut du MO/réseau","Année financière\nChoix possibles:\nJanvier-Décembre\nAvril-Mars\nMai-Avril\nJuillet-Juin","Critère d'inclusion et d'exclusion","Parc de \nbâtiment",{"$f":"DH32","v":"Superficie"},{"$f":"DI32","v":"Nombre de bâtiments"},"Superficie/bâtiment",{"$f":"'1. IDENTITÉ'!A13","v":"Catégorie :"},{"$f":"'1. IDENTITÉ'!A24","v":"Intensité énergétique minimale :"},{"$f":"'1. IDENTITÉ'!A25","v":"Intensité énergétique maximale :"},null,null,null,null,null,null,null,null,null,null,null,null,null,null,null,"Code du MO",null,null,null,null,null,null,null,null,null,"propriété","location",null,null,{"$f":"'1. IDENTITÉ'!A14","v":"Nom de la personne responsable :"},{"$f":"'1. IDENTITÉ'!A15","v":"Titre :"},{"$f":"'1. IDENTITÉ'!A16","v":"Adresse :"},{"$f":"'1. IDENTITÉ'!A17","v":"Ville :"},{"$f":"'1. IDENTITÉ'!A18","v":"Téléphone :"},{"$f":"'1. IDENTITÉ'!A19","v":"Courriel :"},{"$f":"'1. IDENTITÉ'!A20","v":"Date :"},{"$f":"'1. IDENTITÉ'!A21","v":"Année financière :"},{"$f":"'1. IDENTITÉ'!A22","v":"Année de référence :"},{"$f":"'1. IDENTITÉ'!A23","v":"Facteur de consommation variable :"}]
[null,{"$f":"IF('1. IDENTITÉ'!$B$11<>0,'1. IDENTITÉ'!$B$11,IF(ISERROR(VLOOKUP(Transition!E8,ListeMO!$B$3:$C$133,2,FALSE)),\"\",VLOOKUP(Transition!E8,ListeMO!$B$3:$C$133,2,FALSE)))","v":""},{"$f":"B41","v":"2009-2010"},{"$f":"'1. IDENTITÉ'!$B$12","v":0},{"$f":"'1. IDENTITÉ'!$B$10","v":"NOM DE L'ENTITÉ"},null,null,null,null,{"$f":"DH41","v":0},{"$f":"DI41","v":0},null,{"$f":"'1. IDENTITÉ'!$B$13","v":0},{"$f":"'1. IDENTITÉ'!$B$24","v":0},{"$f":"'1. IDENTITÉ'!$B$25","v":0},null,null,null,null,null,null,null,null,null,null,null,null,null,null,null,{"$f":"CONCATENATE(B8,\"-\",C8)","v":"-2009-2010"},null,null,null,null,null,null,null,null,null,"X",null,null,null,{"$f":"'1. IDENTITÉ'!$B$14","v":0},{"$f":"'1. IDENTITÉ'!$B$15","v":0},{"$f":"'1. IDENTITÉ'!$B$16","v":0},{"$f":"'1. IDENTITÉ'!$B$17","v":0},{"$f":"'1. IDENTITÉ'!$B$18","v":0},{"$f":"'1. IDENTITÉ'!$B$19","v":0},{"$f":"'1. IDENTITÉ'!$B$20","v":0},{"$f":"'1. IDENTITÉ'!$B$21","v":"avril-mars"},{"$f":"'1. IDENTITÉ'!$B$22","v":0},{"$f":"'1. IDENTITÉ'!$B$23","v":0.35}]
[null,{"$f":"IF('1. IDENTITÉ'!$B$11<>0,'1. IDENTITÉ'!$B$11,IF(ISERROR(VLOOKUP(Transition!E9,ListeMO!$B$3:$C$133,2,FALSE)),\"\",VLOOKUP(Transition!E9,ListeMO!$B$3:$C$133,2,FALSE)))","v":""},"2010-2011",{"$f":"'1. IDENTITÉ'!$B$12","v":0},{"$f":"'1. IDENTITÉ'!$B$10","v":"NOM DE L'ENTITÉ"},null,null,null,null,0,0,null,{"$f":"'1. IDENTITÉ'!$B$13","v":0},{"$f":"'1. IDENTITÉ'!$B$24","v":0},{"$f":"'1. IDENTITÉ'!$B$25","v":0},null,null,null,null,null,null,null,null,null,null,null,null,null,null,null,"-2010-2011",null,null,null,null,null,null,null,null,null,"X",null,null,null,{"$f":"'1. IDENTITÉ'!$B$14","v":0},{"$f":"'1. IDENTITÉ'!$B$15","v":0},{"$f":"'1. IDENTITÉ'!$B$16","v":0},{"$f":"'1. IDENTITÉ'!$B$17","v":0},{"$f":"'1. IDENTITÉ'!$B$18","v":0},{"$f":"'1. IDENTITÉ'!$B$19","v":0},{"$f":"'1. IDENTITÉ'!$B$20","v":0},{"$f":"'1. IDENTITÉ'!$B$21","v":"avril-mars"},{"$f":"'1. IDENTITÉ'!$B$22","v":0},{"$f":"'1. IDENTITÉ'!$B$23","v":0.35}]
[null,{"$f":"IF('1. IDENTITÉ'!$B$11<>0,'1. IDENTITÉ'!$B$11,IF(ISERROR(VLOOKUP(Transition!E10,ListeMO!$B$3:$C$133,2,FALSE)),\"\",VLOOKUP(Transition!E10,ListeMO!$B$3:$C$133,2,FALSE)))","v":""},"2011-2012",{"$f":"'1. IDENTITÉ'!$B$12","v":0},{"$f":"'1. IDENTITÉ'!$B$10","v":"NOM DE L'ENTITÉ"},null,null,null,null,0,0,null,{"$f":"'1. IDENTITÉ'!$B$13","v":0},{"$f":"'1. IDENTITÉ'!$B$24","v":0},{"$f":"'1. IDENTITÉ'!$B$25","v":0},null,null,null,null,null,null,null,null,null,null,null,null,null,null,null,"-2011-2012",null,null,null,null,null,null,null,null,null,"X",null,null,null,{"$f":"'1. IDENTITÉ'!$B$14","v":0},{"$f":"'1. IDENTITÉ'!$B$15","v":0},{"$f":"'1. IDENTITÉ'!$B$16","v":0},{"$f":"'1. IDENTITÉ'!$B$17","v":0},{"$f":"'1. IDENTITÉ'!$B$18","v":0},{"$f":"'1. IDENTITÉ'!$B$19","v":0},{"$f":"'1. IDENTITÉ'!$B$20","v":0},{"$f":"'1. IDENTITÉ'!$B$21","v":"avril-mars"},{"$f":"'1. IDENTITÉ'!$B$22","v":0},{"$f":"'1. IDENTITÉ'!$B$23","v":0.35}]
[null,{"$f":"IF('1. IDENTITÉ'!$B$11<>0,'1. IDENTITÉ'!$B$11,IF(ISERROR(VLOOKUP(Transition!E11,ListeMO!$B$3:$C$133,2,FALSE)),\"\",VLOOKUP(Transition!E11,ListeMO!$B$3:$C$133,2,FALSE)))","v":""},"2012-2013",{"$f":"'1. IDENTITÉ'!$B$12","v":0},{"$f":"'1. IDENTITÉ'!$B$10","v":"NOM DE L'ENTITÉ"},null,null,null,null,0,0,null,{"$f":"'1. IDENTITÉ'!$B$13","v":0},{"$f":"'1. IDENTITÉ'!$B$24","v":0},{"$f":"'1. IDENTITÉ'!$B$25","v":0},null,null,null,null,null,null,null,null,null,null,null,null,null,null,null,"-2012-2013",null,null,null,null,null,null,null,null,null,"X",null,null,null,{"$f":"'1. IDENTITÉ'!$B$14","v":0},{"$f":"'1. IDENTITÉ'!$B$15","v":0},{"$f":"'1. IDENTITÉ'!$B$16","v":0},{"$f":"'1. IDENTITÉ'!$B$17","v":0},{"$f":"'1. IDENTITÉ'!$B$18","v":0},{"$f":"'1. IDENTITÉ'!$B$19","v":0},{"$f":"'1. IDENTITÉ'!$B$20","v":0},{"$f":"'1. IDENTITÉ'!$B$21","v":"avril-mars"},{"$f":"'1. IDENTITÉ'!$B$22","v":0},{"$f":"'1. IDENTITÉ'!$B$23","v":0.35}]
[null,{"$f":"IF('1. IDENTITÉ'!$B$11<>0,'1. IDENTITÉ'!$B$11,IF(ISERROR(VLOOKUP(Transition!E12,ListeMO!$B$3:$C$133,2,FALSE)),\"\",VLOOKUP(Transition!E12,ListeMO!$B$3:$C$133,2,FALSE)))","v":""},"2013-2014",{"$f":"'1. IDENTITÉ'!$B$12","v":0},{"$f":"'1. IDENTITÉ'!$B$10","v":"NOM DE L'ENTITÉ"},null,null,null,null,0,0,null,{"$f":"'1. IDENTITÉ'!$B$13","v":0},{"$f":"'1. IDENTITÉ'!$B$24","v":0},{"$f":"'1. IDENTITÉ'!$B$25","v":0},null,null,null,null,null,null,null,null,null,null,null,null,null,null,null,"-2013-2014",null,null,null,null,null,null,null,null,null,"X",null,null,null,{"$f":"'1. IDENTITÉ'!$B$14","v":0},{"$f":"'1. IDENTITÉ'!$B$15","v":0},{"$f":"'1. IDENTITÉ'!$B$16","v":0},{"$f":"'1. IDENTITÉ'!$B$17","v":0},{"$f":"'1. IDENTITÉ'!$B$18","v":0},{"$f":"'1. IDENTITÉ'!$B$19","v":0},{"$f":"'1. IDENTITÉ'!$B$20","v":0},{"$f":"'1. IDENTITÉ'!$B$21","v":"avril-mars"},{"$f":"'1. IDENTITÉ'!$B$22","v":0},{"$f":"'1. IDENTITÉ'!$B$23","v":0.35}]
[null,{"$f":"IF('1. IDENTITÉ'!$B$11<>0,'1. IDENTITÉ'!$B$11,IF(ISERROR(VLOOKUP(Transition!E13,ListeMO!$B$3:$C$133,2,FALSE)),\"\",VLOOKUP(Transition!E13,ListeMO!$B$3:$C$133,2,FALSE)))","v":""},"2014-2015",{"$f":"'1. IDENTITÉ'!$B$12","v":0},{"$f":"'1. IDENTITÉ'!$B$10","v":"NOM DE L'ENTITÉ"},null,null,null,null,0,0,null,{"$f":"'1. IDENTITÉ'!$B$13","v":0},{"$f":"'1. IDENTITÉ'!$B$24","v":0},{"$f":"'1. IDENTITÉ'!$B$25","v":0},null,null,null,null,null,null,null,null,null,null,null,null,null,null,null,"-2014-2015",null,null,null,null,null,null,null,null,null,"X",null,null,null,{"$f":"'1. IDENTITÉ'!$B$14","v":0},{"$f":"'1. IDENTITÉ'!$B$15","v":0},{"$f":"'1. IDENTITÉ'!$B$16","v":0},{"$f":"'1. IDENTITÉ'!$B$17","v":0},{"$f":"'1. IDENTITÉ'!$B$18","v":0},{"$f":"'1. IDENTITÉ'!$B$19","v":0},{"$f":"'1. IDENTITÉ'!$B$20","v":0},{"$f":"'1. IDENTITÉ'!$B$21","v":"avril-mars"},{"$f":"'1. IDENTITÉ'!$B$22","v":0},{"$f":"'1. IDENTITÉ'!$B$23","v":0.35}]
[null,{"$f":"IF('1. IDENTITÉ'!$B$11<>0,'1. IDENTITÉ'!$B$11,IF(ISERROR(VLOOKUP(Transition!E14,ListeMO!$B$3:$C$133,2,FALSE)),\"\",VLOOKUP(Transition!E14,ListeMO!$B$3:$C$133,2,FALSE)))","v":""},"2015-2016",{"$f":"'1. IDENTITÉ'!$B$12","v":0},{"$f":"'1. IDENTITÉ'!$B$10","v":"NOM DE L'ENTITÉ"},null,null,null,null,0,0,null,{"$f":"'1. IDENTITÉ'!$B$13","v":0},{"$f":"'1. IDENTITÉ'!$B$24","v":0},{"$f":"'1. IDENTITÉ'!$B$25","v":0},null,null,null,null,null,null,null,null,null,null,null,null,null,null,null,"-2015-2016",null,null,null,null,null,null,null,null,null,"X",null,null,null,{"$f":"'1. IDENTITÉ'!$B$14","v":0},{"$f":"'1. IDENTITÉ'!$B$15","v":0},{"$f":"'1. IDENTITÉ'!$B$16","v":0},{"$f":"'1. IDENTITÉ'!$B$17","v":0},{"$f":"'1. IDENTITÉ'!$B$18","v":0},{"$f":"'1. IDENTITÉ'!$B$19","v":0},{"$f":"'1. IDENTITÉ'!$B$20","v":0},{"$f":"'1. IDENTITÉ'!$B$21","v":"avril-mars"},{"$f":"'1. IDENTITÉ'!$B$22","v":0},{"$f":"'1. IDENTITÉ'!$B$23","v":0.35}]
[null,{"$f":"IF('1. IDENTITÉ'!$B$11<>0,'1. IDENTITÉ'!$B$11,IF(ISERROR(VLOOKUP(Transition!E15,ListeMO!$B$3:$C$133,2,FALSE)),\"\",VLOOKUP(Transition!E15,ListeMO!$B$3:$C$133,2,FALSE)))","v":""},"2016-2017",{"$f":"'1. IDENTITÉ'!$B$12","v":0},{"$f":"'1. IDENTITÉ'!$B$10","v":"NOM DE L'ENTITÉ"},null,null,null,null,0,0,null,{"$f":"'1. IDENTITÉ'!$B$13","v":0},{"$f":"'1. IDENTITÉ'!$B$24","v":0},{"$f":"'1. IDENTITÉ'!$B$25","v":0},null,null,null,null,null,null,null,null,null,null,null,null,null,null,null,"-2016-2017",null,null,null,null,null,null,null,null,null,"X",null,null,null,{"$f":"'1. IDENTITÉ'!$B$14","v":0},{"$f":"'1. IDENTITÉ'!$B$15","v":0},{"$f":"'1. IDENTITÉ'!$B$16","v":0},{"$f":"'1. IDENTITÉ'!$B$17","v":0},{"$f":"'1. IDENTITÉ'!$B$18","v":0},{"$f":"'1. IDENTITÉ'!$B$19","v":0},{"$f":"'1. IDENTITÉ'!$B$20","v":0},{"$f":"'1. IDENTITÉ'!$B$21","v":"avril-mars"},{"$f":"'1. IDENTITÉ'!$B$22","v":0},{"$f":"'1. IDENTITÉ'!$B$23","v":0.35}]
[null,{"$f":"IF('1. IDENTITÉ'!$B$11<>0,'1. IDENTITÉ'!$B$11,IF(ISERROR(VLOOKUP(Transition!E16,ListeMO!$B$3:$C$133,2,FALSE)),\"\",VLOOKUP(Transition!E16,ListeMO!$B$3:$C$133,2,FALSE)))","v":""},"2017-2018",{"$f":"'1. IDENTITÉ'!$B$12","v":0},{"$f":"'1. IDENTITÉ'!$B$10","v":"NOM DE L'ENTITÉ"},null,null,null,null,0,0,null,{"$f":"'1. IDENTITÉ'!$B$13","v":0},{"$f":"'1. IDENTITÉ'!$B$24","v":0},{"$f":"'1. IDENTITÉ'!$B$25","v":0},null,null,null,null,null,null,null,null,null,null,null,null,null,null,null,"-2017-2018",null,null,null,null,null,null,null,null,null,"X",null,null,null,{"$f":"'1. IDENTITÉ'!$B$14","v":0},{"$f":"'1. IDENTITÉ'!$B$15","v":0},{"$f":"'1. IDENTITÉ'!$B$16","v":0},{"$f":"'1. IDENTITÉ'!$B$17","v":0},{"$f":"'1. IDENTITÉ'!$B$18","v":0},{"$f":"'1. IDENTITÉ'!$B$19","v":0},{"$f":"'1. IDENTITÉ'!$B$20","v":0},{"$f":"'1. IDENTITÉ'!$B$21","v":"avril-mars"},{"$f":"'1. IDENTITÉ'!$B$22","v":0},{"$f":"'1. IDENTITÉ'!$B$23","v":0.35}]
[null,{"$f":"IF('1. IDENTITÉ'!$B$11<>0,'1. IDENTITÉ'!$B$11,IF(ISERROR(VLOOKUP(Transition!E17,ListeMO!$B$3:$C$133,2,FALSE)),\"\",VLOOKUP(Transition!E17,ListeMO!$B$3:$C$133,2,FALSE)))","v":""},"2018-2019",{"$f":"'1. IDENTITÉ'!$B$12","v":0},{"$f":"'1. IDENTITÉ'!$B$10","v":"NOM DE L'ENTITÉ"},null,null,null,null,0,0,null,{"$f":"'1. IDENTITÉ'!$B$13","v":0},{"$f":"'1. IDENTITÉ'!$B$24","v":0},{"$f":"'1. IDENTITÉ'!$B$25","v":0},null,null,null,null,null,null,null,null,null,null,null,null,null,null,null,"-2018-2019",null,null,null,null,null,null,null,null,null,"X",null,null,null,{"$f":"'1. IDENTITÉ'!$B$14","v":0},{"$f":"'1. IDENTITÉ'!$B$15","v":0},{"$f":"'1. IDENTITÉ'!$B$16","v":0},{"$f":"'1. IDENTITÉ'!$B$17","v":0},{"$f":"'1. IDENTITÉ'!$B$18","v":0},{"$f":"'1. IDENTITÉ'!$B$19","v":0},{"$f":"'1. IDENTITÉ'!$B$20","v":0},{"$f":"'1. IDENTITÉ'!$B$21","v":"avril-mars"},{"$f":"'1. IDENTITÉ'!$B$22","v":0},{"$f":"'1. IDENTITÉ'!$B$23","v":0.35}]
[null,{"$f":"IF('1. IDENTITÉ'!$B$11<>0,'1. IDENTITÉ'!$B$11,IF(ISERROR(VLOOKUP(Transition!E18,ListeMO!$B$3:$C$133,2,FALSE)),\"\",VLOOKUP(Transition!E18,ListeMO!$B$3:$C$133,2,FALSE)))","v":""},"2019-2020",{"$f":"'1. IDENTITÉ'!$B$12","v":0},{"$f":"'1. IDENTITÉ'!$B$10","v":"NOM DE L'ENTITÉ"},null,null,null,null,0,0,null,{"$f":"'1. IDENTITÉ'!$B$13","v":0},{"$f":"'1. IDENTITÉ'!$B$24","v":0},{"$f":"'1. IDENTITÉ'!$B$25","v":0},null,null,null,null,null,null,null,null,null,null,null,null,null,null,null,"-2019-2020",null,null,null,null,null,null,null,null,null,"X",null,null,null,{"$f":"'1. IDENTITÉ'!$B$14","v":0},{"$f":"'1. IDENTITÉ'!$B$15","v":0},{"$f":"'1. IDENTITÉ'!$B$16","v":0},{"$f":"'1. IDENTITÉ'!$B$17","v":0},{"$f":"'1. IDENTITÉ'!$B$18","v":0},{"$f":"'1. IDENTITÉ'!$B$19","v":0},{"$f":"'1. IDENTITÉ'!$B$20","v":0},{"$f":"'1. IDENTITÉ'!$B$21","v":"avril-mars"},{"$f":"'1. IDENTITÉ'!$B$22","v":0},{"$f":"'1. IDENTITÉ'!$B$23","v":0.35}]
[null,{"$f":"IF('1. IDENTITÉ'!$B$11<>0,'1. IDENTITÉ'!$B$11,IF(ISERROR(VLOOKUP(Transition!E19,ListeMO!$B$3:$C$133,2,FALSE)),\"\",VLOOKUP(Transition!E19,ListeMO!$B$3:$C$133,2,FALSE)))","v":""},"2020-2021",{"$f":"'1. IDENTITÉ'!$B$12","v":0},{"$f":"'1. IDENTITÉ'!$B$10","v":"NOM DE L'ENTITÉ"},null,null,null,null,0,0,null,{"$f":"'1. IDENTITÉ'!$B$13","v":0},{"$f":"'1. IDENTITÉ'!$B$24","v":0},{"$f":"'1. IDENTITÉ'!$B$25","v":0},null,null,null,null,null,null,null,null,null,null,null,null,null,null,null,"-2020-2021",null,null,null,null,null,null,null,null,null,"X",null,null,null,{"$f":"'1. IDENTITÉ'!$B$14","v":0},{"$f":"'1. IDENTITÉ'!$B$15","v":0},{"$f":"'1. IDENTITÉ'!$B$16","v":0},{"$f":"'1. IDENTITÉ'!$B$17","v":0},{"$f":"'1. IDENTITÉ'!$B$18","v":0},{"$f":"'1. IDENTITÉ'!$B$19","v":0},{"$f":"'1. IDENTITÉ'!$B$20","v":0},{"$f":"'1. IDENTITÉ'!$B$21","v":"avril-mars"},{"$f":"'1. IDENTITÉ'!$B$22","v":0},{"$f":"'1. IDENTITÉ'!$B$23","v":0.35}]
[null,{"$f":"IF('1. IDENTITÉ'!$B$11<>0,'1. IDENTITÉ'!$B$11,IF(ISERROR(VLOOKUP(Transition!E20,ListeMO!$B$3:$C$133,2,FALSE)),\"\",VLOOKUP(Transition!E20,ListeMO!$B$3:$C$133,2,FALSE)))","v":""},"2021-2022",{"$f":"'1. IDENTITÉ'!$B$12","v":0},{"$f":"'1. IDENTITÉ'!$B$10","v":"NOM DE L'ENTITÉ"},null,null,null,null,0,0,null,{"$f":"'1. IDENTITÉ'!$B$13","v":0},{"$f":"'1. IDENTITÉ'!$B$24","v":0},{"$f":"'1. IDENTITÉ'!$B$25","v":0},null,null,null,null,null,null,null,null,null,null,null,null,null,null,null,"-2021-2022",null,null,null,null,null,null,null,null,null,"X",null,null,null,{"$f":"'1. IDENTITÉ'!$B$14","v":0},{"$f":"'1. IDENTITÉ'!$B$15","v":0},{"$f":"'1. IDENTITÉ'!$B$16","v":0},{"$f":"'1. IDENTITÉ'!$B$17","v":0},{"$f":"'1. IDENTITÉ'!$B$18","v":0},{"$f":"'1. IDENTITÉ'!$B$19","v":0},{"$f":"'1. IDENTITÉ'!$B$20","v":0},{"$f":"'1. IDENTITÉ'!$B$21","v":"avril-mars"},{"$f":"'1. IDENTITÉ'!$B$22","v":0},{"$f":"'1. IDENTITÉ'!$B$23","v":0.35}]
[null,{"$f":"IF('1. IDENTITÉ'!$B$11<>0,'1. IDENTITÉ'!$B$11,IF(ISERROR(VLOOKUP(Transition!E21,ListeMO!$B$3:$C$133,2,FALSE)),\"\",VLOOKUP(Transition!E21,ListeMO!$B$3:$C$133,2,FALSE)))","v":""},"2022-2023",{"$f":"'1. IDENTITÉ'!$B$12","v":0},{"$f":"'1. IDENTITÉ'!$B$10","v":"NOM DE L'ENTITÉ"},null,null,null,null,0,0,null,{"$f":"'1. IDENTITÉ'!$B$13","v":0},{"$f":"'1. IDENTITÉ'!$B$24","v":0},{"$f":"'1. IDENTITÉ'!$B$25","v":0},null,null,null,null,null,null,null,null,null,null,null,null,null,null,null,"-2022-2023",null,null,null,null,null,null,null,null,null,"X",null,null,null,{"$f":"'1. IDENTITÉ'!$B$14","v":0},{"$f":"'1. IDENTITÉ'!$B$15","v":0},{"$f":"'1. IDENTITÉ'!$B$16","v":0},{"$f":"'1. IDENTITÉ'!$B$17","v":0},{"$f":"'1. IDENTITÉ'!$B$18","v":0},{"$f":"'1. IDENTITÉ'!$B$19","v":0},{"$f":"'1. IDENTITÉ'!$B$20","v":0},{"$f":"'1. IDENTITÉ'!$B$21","v":"avril-mars"},{"$f":"'1. IDENTITÉ'!$B$22","v":0},{"$f":"'1. IDENTITÉ'!$B$23","v":0.35}]
[null,{"$f":"IF('1. IDENTITÉ'!$B$11<>0,'1. IDENTITÉ'!$B$11,IF(ISERROR(VLOOKUP(Transition!E22,ListeMO!$B$3:$C$133,2,FALSE)),\"\",VLOOKUP(Transition!E22,ListeMO!$B$3:$C$133,2,FALSE)))","v":""},"2023-2024",{"$f":"'1. IDENTITÉ'!$B$12","v":0},{"$f":"'1. IDENTITÉ'!$B$10","v":"NOM DE L'ENTITÉ"},null,null,null,null,0,0,null,{"$f":"'1. IDENTITÉ'!$B$13","v":0},{"$f":"'1. IDENTITÉ'!$B$24","v":0},{"$f":"'1. IDENTITÉ'!$B$25","v":0},null,null,null,null,null,null,null,null,null,null,null,null,null,null,null,"-2023-2024",null,null,null,null,null,null,null,null,null,"X",null,null,null,{"$f":"'1. IDENTITÉ'!$B$14","v":0},{"$f":"'1. IDENTITÉ'!$B$15","v":0},{"$f":"'1. IDENTITÉ'!$B$16","v":0},{"$f":"'1. IDENTITÉ'!$B$17","v":0},{"$f":"'1. IDENTITÉ'!$B$18","v":0},{"$f":"'1. IDENTITÉ'!$B$19","v":0},{"$f":"'1. IDENTITÉ'!$B$20","v":0},{"$f":"'1. IDENTITÉ'!$B$21","v":"avril-mars"},{"$f":"'1. IDENTITÉ'!$B$22","v":0},{"$f":"'1. IDENTITÉ'!$B$23","v":0.35}]
[null,{"$f":"IF('1. IDENTITÉ'!$B$11<>0,'1. IDENTITÉ'!$B$11,IF(ISERROR(VLOOKUP(Transition!E23,ListeMO!$B$3:$C$133,2,FALSE)),\"\",VLOOKUP(Transition!E23,ListeMO!$B$3:$C$133,2,FALSE)))","v":""},"2024-2025",{"$f":"'1. IDENTITÉ'!$B$12","v":0},{"$f":"'1. IDENTITÉ'!$B$10","v":"NOM DE L'ENTITÉ"},null,null,null,null,0,0,null,{"$f":"'1. IDENTITÉ'!$B$13","v":0},{"$f":"'1. IDENTITÉ'!$B$24","v":0},{"$f":"'1. IDENTITÉ'!$B$25","v":0},null,null,null,null,null,null,null,null,null,null,null,null,null,null,null,"-2024-2025",null,null,null,null,null,null,null,null,null,"X",null,null,null,{"$f":"'1. IDENTITÉ'!$B$14","v":0},{"$f":"'1. IDENTITÉ'!$B$15","v":0},{"$f":"'1. IDENTITÉ'!$B$16","v":0},{"$f":"'1. IDENTITÉ'!$B$17","v":0},{"$f":"'1. IDENTITÉ'!$B$18","v":0},{"$f":"'1. IDENTITÉ'!$B$19","v":0},{"$f":"'1. IDENTITÉ'!$B$20","v":0},{"$f":"'1. IDENTITÉ'!$B$21","v":"avril-mars"},{"$f":"'1. IDENTITÉ'!$B$22","v":0},{"$f":"'1. IDENTITÉ'!$B$23","v":0.35}]
[null,{"$f":"IF('1. IDENTITÉ'!$B$11<>0,'1. IDENTITÉ'!$B$11,IF(ISERROR(VLOOKUP(Transition!E24,ListeMO!$B$3:$C$133,2,FALSE)),\"\",VLOOKUP(Transition!E24,ListeMO!$B$3:$C$133,2,FALSE)))","v":""},"2025-2026",{"$f":"'1. IDENTITÉ'!$B$12","v":0},{"$f":"'1. IDENTITÉ'!$B$10","v":"NOM DE L'ENTITÉ"},null,null,null,null,0,0,null,{"$f":"'1. IDENTITÉ'!$B$13","v":0},{"$f":"'1. IDENTITÉ'!$B$24","v":0},{"$f":"'1. IDENTITÉ'!$B$25","v":0},null,null,null,null,null,null,null,null,null,null,null,null,null,null,null,"-2025-2026",null,null,null,null,null,null,null,null,null,"X",null,null,null,{"$f":"'1. IDENTITÉ'!$B$14","v":0},{"$f":"'1. IDENTITÉ'!$B$15","v":0},{"$f":"'1. IDENTITÉ'!$B$16","v":0},{"$f":"'1. IDENTITÉ'!$B$17","v":0},{"$f":"'1. IDENTITÉ'!$B$18","v":0},{"$f":"'1. IDENTITÉ'!$B$19","v":0},{"$f":"'1. IDENTITÉ'!$B$20","v":0},{"$f":"'1. IDENTITÉ'!$B$21","v":"avril-mars"},{"$f":"'1. IDENTITÉ'!$B$22","v":0},{"$f":"'1. IDENTITÉ'!$B$23","v":0.35}]
[null,{"$f":"IF('1. IDENTITÉ'!$B$11<>0,'1. IDENTITÉ'!$B$11,IF(ISERROR(VLOOKUP(Transition!E25,ListeMO!$B$3:$C$133,2,FALSE)),\"\",VLOOKUP(Transition!E25,ListeMO!$B$3:$C$133,2,FALSE)))","v":""},"2026-2027",{"$f":"'1. IDENTITÉ'!$B$12","v":0},{"$f":"'1. IDENTITÉ'!$B$10","v":"NOM DE L'ENTITÉ"},null,null,null,null,0,0,null,{"$f":"'1. IDENTITÉ'!$B$13","v":0},{"$f":"'1. IDENTITÉ'!$B$24","v":0},{"$f":"'1. IDENTITÉ'!$B$25","v":0},null,null,null,null,null,null,null,null,null,null,null,null,null,null,null,"-2026-2027",null,null,null,null,null,null,null,null,null,"X",null,null,null,{"$f":"'1. IDENTITÉ'!$B$14","v":0},{"$f":"'1. IDENTITÉ'!$B$15","v":0},{"$f":"'1. IDENTITÉ'!$B$16","v":0},{"$f":"'1. IDENTITÉ'!$B$17","v":0},{"$f":"'1. IDENTITÉ'!$B$18","v":0},{"$f":"'1. IDENTITÉ'!$B$19","v":0},{"$f":"'1. IDENTITÉ'!$B$20","v":0},{"$f":"'1. IDENTITÉ'!$B$21","v":"avril-mars"},{"$f":"'1. IDENTITÉ'!$B$22","v":0},{"$f":"'1. IDENTITÉ'!$B$23","v":0.35}]
[null,{"$f":"IF('1. IDENTITÉ'!$B$11<>0,'1. IDENTITÉ'!$B$11,IF(ISERROR(VLOOKUP(Transition!E26,ListeMO!$B$3:$C$133,2,FALSE)),\"\",VLOOKUP(Transition!E26,ListeMO!$B$3:$C$133,2,FALSE)))","v":""},"2027-2028",{"$f":"'1. IDENTITÉ'!$B$12","v":0},{"$f":"'1. IDENTITÉ'!$B$10","v":"NOM DE L'ENTITÉ"},null,null,null,null,0,0,null,{"$f":"'1. IDENTITÉ'!$B$13","v":0},{"$f":"'1. IDENTITÉ'!$B$24","v":0},{"$f":"'1. IDENTITÉ'!$B$25","v":0},null,null,null,null,null,null,null,null,null,null,null,null,null,null,null,"-2027-2028",null,null,null,null,null,null,null,null,null,"X",null,null,null,{"$f":"'1. IDENTITÉ'!$B$14","v":0},{"$f":"'1. IDENTITÉ'!$B$15","v":0},{"$f":"'1. IDENTITÉ'!$B$16","v":0},{"$f":"'1. IDENTITÉ'!$B$17","v":0},{"$f":"'1. IDENTITÉ'!$B$18","v":0},{"$f":"'1. IDENTITÉ'!$B$19","v":0},{"$f":"'1. IDENTITÉ'!$B$20","v":0},{"$f":"'1. IDENTITÉ'!$B$21","v":"avril-mars"},{"$f":"'1. IDENTITÉ'!$B$22","v":0},{"$f":"'1. IDENTITÉ'!$B$23","v":0.35}]
[null,{"$f":"IF('1. IDENTITÉ'!$B$11<>0,'1. IDENTITÉ'!$B$11,IF(ISERROR(VLOOKUP(Transition!E27,ListeMO!$B$3:$C$133,2,FALSE)),\"\",VLOOKUP(Transition!E27,ListeMO!$B$3:$C$133,2,FALSE)))","v":""},"2028-2029",{"$f":"'1. IDENTITÉ'!$B$12","v":0},{"$f":"'1. IDENTITÉ'!$B$10","v":"NOM DE L'ENTITÉ"},null,null,null,null,0,0,null,{"$f":"'1. IDENTITÉ'!$B$13","v":0},{"$f":"'1. IDENTITÉ'!$B$24","v":0},{"$f":"'1. IDENTITÉ'!$B$25","v":0},null,null,null,null,null,null,null,null,null,null,null,null,null,null,null,"-2028-2029",null,null,null,null,null,null,null,null,null,"X",null,null,null,{"$f":"'1. IDENTITÉ'!$B$14","v":0},{"$f":"'1. IDENTITÉ'!$B$15","v":0},{"$f":"'1. IDENTITÉ'!$B$16","v":0},{"$f":"'1. IDENTITÉ'!$B$17","v":0},{"$f":"'1. IDENTITÉ'!$B$18","v":0},{"$f":"'1. IDENTITÉ'!$B$19","v":0},{"$f":"'1. IDENTITÉ'!$B$20","v":0},{"$f":"'1. IDENTITÉ'!$B$21","v":"avril-mars"},{"$f":"'1. IDENTITÉ'!$B$22","v":0},{"$f":"'1. IDENTITÉ'!$B$23","v":0.35}]
[null,{"$f":"IF('1. IDENTITÉ'!$B$11<>0,'1. IDENTITÉ'!$B$11,IF(ISERROR(VLOOKUP(Transition!E28,ListeMO!$B$3:$C$133,2,FALSE)),\"\",VLOOKUP(Transition!E28,ListeMO!$B$3:$C$133,2,FALSE)))","v":""},"2029-2030",{"$f":"'1. IDENTITÉ'!$B$12","v":0},{"$f":"'1. IDENTITÉ'!$B$10","v":"NOM DE L'ENTITÉ"},null,null,null,null,0,0,null,{"$f":"'1. IDENTITÉ'!$B$13","v":0},{"$f":"'1. IDENTITÉ'!$B$24","v":0},{"$f":"'1. IDENTITÉ'!$B$25","v":0},null,null,null,null,null,null,null,null,null,null,null,null,null,null,null,"-2029-2030",null,null,null,null,null,null,null,null,null,"X",null,null,null,{"$f":"'1. IDENTITÉ'!$B$14","v":0},{"$f":"'1. IDENTITÉ'!$B$15","v":0},{"$f":"'1. IDENTITÉ'!$B$16","v":0},{"$f":"'1. IDENTITÉ'!$B$17","v":0},{"$f":"'1. IDENTITÉ'!$B$18","v":0},{"$f":"'1. IDENTITÉ'!$B$19","v":0},{"$f":"'1. IDENTITÉ'!$B$20","v":0},{"$f":"'1. IDENTITÉ'!$B$21","v":"avril-mars"},{"$f":"'1. IDENTITÉ'!$B$22","v":0},{"$f":"'1. IDENTITÉ'!$B$23","v":0.35}]
[]
[]
[null,{"$f":"'1. IDENTITÉ'!C16","v":0},{"$f":"'1. IDENTITÉ'!E16","v":0},{"$f":"'1. IDENTITÉ'!F16","v":0}]
[null,{"$f":"RÉSUMÉ!A1","v":0},{"$f":"RÉSUMÉ!B1","v":"TOTAL"},{"$f":"RÉSUMÉ!C1","v":0},{"$f":"RÉSUMÉ!D1","v":0},{"$f":"RÉSUMÉ!E1","v":"Intensité énergétique"},{"$f":"RÉSUMÉ!F1","v":0},{"$f":"RÉSUMÉ!G1","v":0},{"$f":"RÉSUMÉ!H1","v":"GES"},{"$f":"RÉSUMÉ!I1","v":0},{"$f":"RÉSUMÉ!J1","v":"Économie d'énergie"},{"$f":"RÉSUMÉ!K1","v":0},null,null,null,null,{"$f":"RÉSUMÉ!Q1","v":"Consommation électrique"},{"$f":"RÉSUMÉ!R1","v":0},null,null,null,null,null,{"$f":"RÉSUMÉ!S1","v":"Gaz naturel"},{"$f":"RÉSUMÉ!T1","v":0},null,null,null,null,null,{"$f":"RÉSUMÉ!U1","v":"Mazout n°2"},{"$f":"RÉSUMÉ!V1","v":0},null,null,null,null,null,{"$f":"RÉSUMÉ!W1","v":"Mazout n°6"},{"$f":"RÉSUMÉ!X1","v":0},null,null,null,null,null,"Diesel génératrice",null,null,null,null,null,null,{"$f":"RÉSUMÉ!AA1","v":"Propane"},{"$f":"RÉSUMÉ!AB1","v":0},null,null,null,null,null,{"$f":"RÉSUMÉ!AC1","v":"Résidus de bois\n (8 % d'humidité)"},{"$f":"RÉSUMÉ!AD1","v":0},null,null,null,null,null,{"$f":"RÉSUMÉ!AE1","v":"Résidus de bois\n(35 % d'humidité)"},{"$f":"RÉSUMÉ!AF1","v":0},null,null,null,null,null,"Vapeur",null,null,null,null,null,null,"Eau refroidie",null,null,null,null,null,null,"Eau chaude",null,null,null,null,null,null,{"$f":"RÉSUMÉ!AM1","v":"DJC"},{"$f":"RÉSUMÉ!AN1","v":"Superficie contient des surfaces louées"},{"$f":"RÉSUMÉ!AO1","v":"Valeurs de consommation proviennent de surfaces des surfaces louées"},{"$f":"RÉSUMÉ!AP1","v":"Projet(s) modifiant la superficie fait(s) lors de l'année de suivi"},{"$f":"RÉSUMÉ!AQ1","v":"Taxes de ventes inclues dans le montant dépensé en énergie"},{"$f":"RÉSUMÉ!AR1","v":"Murs extérieurs exclus de la superficie"},null,null,null,null,null,null,null,null,null,{"$f":"RÉSUMÉ!L1","v":"Économie de coûts"},{"$f":"RÉSUMÉ!M1","v":0},{"$f":"RÉSUMÉ!N1","v":"Économie de GES"},{"$f":"RÉSUMÉ!O1","v":"Superficie"},{"$f":"RÉSUMÉ!P1","v":"Nombre de bâtiments"}]
[null,{"$f":"RÉSUMÉ!A2","v":0},{"$f":"RÉSUMÉ!B2","v":" [GJ réel]"},{"$f":"RÉSUMÉ!C2","v":"[GJ 09-10 ajusté]"},{"$f":"RÉSUMÉ!D2","v":"[$ réel]"},{"$f":"RÉSUMÉ!E2","v":"[GJ réel/m²]"},{"$f":"RÉSUMÉ!F2","v":"[GJ 09-10 ajusté/m²]"},{"$f":"RÉSUMÉ!G2","v":"[$ réel/m²]"},{"$f":"RÉSUMÉ!H2","v":"[t éq. CO2]"},{"$f":"RÉSUMÉ!I2","v":"[kg éq. CO2/m²]"},{"$f":"RÉSUMÉ!J2","v":"[GJ ajusté/m²]"},{"$f":"RÉSUMÉ!K2","v":"[%]"},null,null,null,null,{"$f":"RÉSUMÉ!Q2","v":" [kWh]"},{"$f":"RÉSUMÉ!R2","v":" [$]"},null,null,null,null,null,{"$f":"RÉSUMÉ!S2","v":" [m³]"},{"$f":"RÉSUMÉ!T2","v":" [$]"},null,null,null,null,null,{"$f":"RÉSUMÉ!U2","v":" [l]"},{"$f":"RÉSUMÉ!V2","v":" [$]"},null,null,null,null,null,{"$f":"RÉSUMÉ!W2","v":" [l]"},{"$f":"RÉSUMÉ!X2","v":" [$]"},null,null,null,null,null," [l]"," [$]",null,null,null,null,null,{"$f":"RÉSUMÉ!AA2","v":" [l]"},{"$f":"RÉSUMÉ!AB2","v":" [$]"},null,null,null,null,null,{"$f":"RÉSUMÉ!AC2","v":" [1000 kg MG]"},{"$f":"RÉSUMÉ!AD2","v":" [$]"},null,null,null,null,null,{"$f":"RÉSUMÉ!AE2","v":" [1000 kg MG]"},{"$f":"RÉSUMÉ!AF2","v":" [$]"},null,null,null,null,null,{"$f":"RÉSUMÉ!AG2","v":"[lbs]"},{"$f":"RÉSUMÉ!AH2","v":" [$]"},null,null,null,null,null,{"$f":"RÉSUMÉ!AI2","v":"[MBTU]"},{"$f":"RÉSUMÉ!AJ2","v":" [$]"},null,null,null,null,null,{"$f":"RÉSUMÉ!AK2","v":"[MBTU]"},{"$f":"RÉSUMÉ!AL2","v":" [$]"},null,null,null,null,null,{"$f":"RÉSUMÉ!AM2","v":" [° C]"},{"$f":"RÉSUMÉ!AN2","v":" [VRAI/FAUX]"},{"$f":"RÉSUMÉ!AO2","v":" [VRAI/FAUX]"},{"$f":"RÉSUMÉ!AP2","v":" [VRAI/FAUX]"},{"$f":"RÉSUMÉ!AQ2","v":" [VRAI/FAUX]"},{"$f":"RÉSUMÉ!AR2","v":" [VRAI/FAUX]"},null,null,null,null,null,null,null,null,null,{"$f":"RÉSUMÉ!L2","v":"[$ réel/m²]"},{"$f":"RÉSUMÉ!M2","v":"[%]"},{"$f":"RÉSUMÉ!N2","v":"[t éq. CO2]"},{"$f":"RÉSUMÉ!O2","v":"[m²]"},{"$f":"RÉSUMÉ!P2","v":0}]
[null,{"$f":"RÉSUMÉ!A3","v":"s"},{"$f":"RÉSUMÉ!B3","v":{"$error":"#REF!"}},{"$f":"RÉSUMÉ!C3","v":0},{"$f":"RÉSUMÉ!D3","v":{"$error":"#REF!"}},{"$f":"RÉSUMÉ!E3","v":0},{"$f":"RÉSUMÉ!F3","v":0},{"$f":"RÉSUMÉ!G3","v":0},{"$f":"RÉSUMÉ!H3","v":{"$error":"#REF!"}},{"$f":"RÉSUMÉ!I3","v":0},{"$f":"RÉSUMÉ!J3","v":0},{"$f":"RÉSUMÉ!K3","v":0},null,null,null,null,{"$f":"RÉSUMÉ!Q3","v":{"$error":"#REF!"}},{"$f":"RÉSUMÉ!R3","v":{"$error":"#REF!"}},null,null,null,null,null,{"$f":"RÉSUMÉ!S3","v":{"$error":"#REF!"}},{"$f":"RÉSUMÉ!T3","v":{"$error":"#REF!"}},null,null,null,null,null,{"$f":"RÉSUMÉ!U3","v":{"$error":"#REF!"}},{"$f":"RÉSUMÉ!V3","v":{"$error":"#REF!"}},null,null,null,null,null,{"$f":"RÉSUMÉ!W3","v":{"$error":"#REF!"}},{"$f":"RÉSUMÉ!X3","v":{"$error":"#REF!"}},null,null,null,null,null,{"$f":"RÉSUMÉ!Y3","v":0},{"$f":"RÉSUMÉ!Z3","v":0},null,null,null,null,null,{"$f":"RÉSUMÉ!AA3","v":{"$error":"#REF!"}},{"$f":"RÉSUMÉ!AB3","v":{"$error":"#REF!"}},null,null,null,null,null,{"$f":"RÉSUMÉ!AC3","v":{"$error":"#REF!"}},{"$f":"RÉSUMÉ!AD3","v":{"$error":"#REF!"}},null,null,null,null,null,{"$f":"RÉSUMÉ!AE3","v":{"$error":"#REF!"}},{"$f":"RÉSUMÉ!AF3","v":{"$error":"#REF!"}},null,null,null,null,null,{"$f":"RÉSUMÉ!AG3","v":0},{"$f":"RÉSUMÉ!AH3","v":0},null,null,null,null,null,{"$f":"RÉSUMÉ!AI3","v":0},{"$f":"RÉSUMÉ!AJ3","v":0},null,null,null,null,null,{"$f":"RÉSUMÉ!AK3","v":0},{"$f":"RÉSUMÉ!AL3","v":0},null,null,null,null,null,{"$f":"RÉSUMÉ!AM3","v":{"$error":"#REF!"}},{"$f":"RÉSUMÉ!AN3","v":0},{"$f":"RÉSUMÉ!AO3","v":0},{"$f":"RÉSUMÉ!AP3","v":0},{"$f":"RÉSUMÉ!AQ3","v":0},{"$f":"RÉSUMÉ!AR3","v":0},null,null,null,null,null,null,null,null,null,{"$f":"RÉSUMÉ!L3","v":0},{"$f":"RÉSUMÉ!M3","v":0},{"$f":"RÉSUMÉ!N3","v":0},{"$f":"RÉSUMÉ!O3","v":0},{"$f":"RÉSUMÉ!P3","v":{"$error":"#REF!"}}]
[null,{"$f":"RÉSUMÉ!A4","v":"2003-2004"},{"$f":"RÉSUMÉ!B4","v":{"$error":"#REF!"}},{"$f":"RÉSUMÉ!C4","v":0},{"$f":"RÉSUMÉ!D4","v":{"$error":"#REF!"}},{"$f":"RÉSUMÉ!E4","v":0},{"$f":"RÉSUMÉ!F4","v":0},{"$f":"RÉSUMÉ!G4","v":0},{"$f":"RÉSUMÉ!H4","v":{"$error":"#REF!"}},{"$f":"RÉSUMÉ!I4","v":0},{"$f":"RÉSUMÉ!J4","v":0},{"$f":"RÉSUMÉ!K4","v":0},null,null,null,null,{"$f":"RÉSUMÉ!Q4","v":{"$error":"#REF!"}},{"$f":"RÉSUMÉ!R4","v":{"$error":"#REF!"}},null,null,null,null,null,{"$f":"RÉSUMÉ!S4","v":{"$error":"#REF!"}},{"$f":"RÉSUMÉ!T4","v":{"$error":"#REF!"}},null,null,null,null,null,{"$f":"RÉSUMÉ!U4","v":{"$error":"#REF!"}},{"$f":"RÉSUMÉ!V4","v":{"$error":"#REF!"}},null,null,null,null,null,{"$f":"RÉSUMÉ!W4","v":{"$error":"#REF!"}},{"$f":"RÉSUMÉ!X4","v":{"$error":"#REF!"}},null,null,null,null,null,{"$f":"RÉSUMÉ!Y4","v":0},{"$f":"RÉSUMÉ!Z4","v":0},null,null,null,null,null,{"$f":"RÉSUMÉ!AA4","v":{"$error":"#REF!"}},{"$f":"RÉSUMÉ!AB4","v":{"$error":"#REF!"}},null,null,null,null,null,{"$f":"RÉSUMÉ!AC4","v":{"$error":"#REF!"}},{"$f":"RÉSUMÉ!AD4","v":{"$error":"#REF!"}},null,null,null,null,null,{"$f":"RÉSUMÉ!AE4","v":{"$error":"#REF!"}},{"$f":"RÉSUMÉ!AF4","v":{"$error":"#REF!"}},null,null,null,null,null,{"$f":"RÉSUMÉ!AG4","v":0},{"$f":"RÉSUMÉ!AH4","v":0},null,null,null,null,null,{"$f":"RÉSUMÉ!AI4","v":0},{"$f":"RÉSUMÉ!AJ4","v":0},null,null,null,null,null,{"$f":"RÉSUMÉ!AK4","v":0},{"$f":"RÉSUMÉ!AL4","v":0},null,null,null,null,null,{"$f":"RÉSUMÉ!AM4","v":{"$error":"#REF!"}},{"$f":"RÉSUMÉ!AN4","v":0},{"$f":"RÉSUMÉ!AO4","v":0},{"$f":"RÉSUMÉ!AP4","v":0},{"$f":"RÉSUMÉ!AQ4","v":0},{"$f":"RÉSUMÉ!AR4","v":0},null,null,null,null,null,null,null,null,null,{"$f":"RÉSUMÉ!L4","v":0},{"$f":"RÉSUMÉ!M4","v":0},{"$f":"RÉSUMÉ!N4","v":0},{"$f":"RÉSUMÉ!O4","v":0},{"$f":"RÉSUMÉ!P4","v":{"$error":"#REF!"}}]
[null,{"$f":"RÉSUMÉ!A5","v":"2004-2005"},{"$f":"RÉSUMÉ!B5","v":{"$error":"#REF!"}},{"$f":"RÉSUMÉ!C5","v":0},{"$f":"RÉSUMÉ!D5","v":{"$error":"#REF!"}},{"$f":"RÉSUMÉ!E5","v":0},{"$f":"RÉSUMÉ!F5","v":0},{"$f":"RÉSUMÉ!G5","v":0},{"$f":"RÉSUMÉ!H5","v":{"$error":"#REF!"}},{"$f":"RÉSUMÉ!I5","v":0},{"$f":"RÉSUMÉ!J5","v":0},{"$f":"RÉSUMÉ!K5","v":0},null,null,null,null,{"$f":"RÉSUMÉ!Q5","v":{"$error":"#REF!"}},{"$f":"RÉSUMÉ!R5","v":{"$error":"#REF!"}},null,null,null,null,null,{"$f":"RÉSUMÉ!S5","v":{"$error":"#REF!"}},{"$f":"RÉSUMÉ!T5","v":{"$error":"#REF!"}},null,null,null,null,null,{"$f":"RÉSUMÉ!U5","v":{"$error":"#REF!"}},{"$f":"RÉSUMÉ!V5","v":{"$error":"#REF!"}},null,null,null,null,null,{"$f":"RÉSUMÉ!W5","v":{"$error":"#REF!"}},{"$f":"RÉSUMÉ!X5","v":{"$error":"#REF!"}},null,null,null,null,null,{"$f":"RÉSUMÉ!Y5","v":0},{"$f":"RÉSUMÉ!Z5","v":0},null,null,null,null,null,{"$f":"RÉSUMÉ!AA5","v":{"$error":"#REF!"}},{"$f":"RÉSUMÉ!AB5","v":{"$error":"#REF!"}},null,null,null,null,null,{"$f":"RÉSUMÉ!AC5","v":{"$error":"#REF!"}},{"$f":"RÉSUMÉ!AD5","v":{"$error":"#REF!"}},null,null,null,null,null,{"$f":"RÉSUMÉ!AE5","v":{"$error":"#REF!"}},{"$f":"RÉSUMÉ!AF5","v":{"$error":"#REF!"}},null,null,null,null,null,{"$f":"RÉSUMÉ!AG5","v":0},{"$f":"RÉSUMÉ!AH5","v":0},null,null,null,null,null,{"$f":"RÉSUMÉ!AI5","v":0},{"$f":"RÉSUMÉ!AJ5","v":0},null,null,null,null,null,{"$f":"RÉSUMÉ!AK5","v":0},{"$f":"RÉSUMÉ!AL5","v":0},null,null,null,null,null,{"$f":"RÉSUMÉ!AM5","v":{"$error":"#REF!"}},{"$f":"RÉSUMÉ!AN5","v":0},{"$f":"RÉSUMÉ!AO5","v":0},{"$f":"RÉSUMÉ!AP5","v":0},{"$f":"RÉSUMÉ!AQ5","v":0},{"$f":"RÉSUMÉ!AR5","v":0},null,null,null,null,null,null,null,null,null,{"$f":"RÉSUMÉ!L5","v":0},{"$f":"RÉSUMÉ!M5","v":0},{"$f":"RÉSUMÉ!N5","v":0},{"$f":"RÉSUMÉ!O5","v":0},{"$f":"RÉSUMÉ!P5","v":{"$error":"#REF!"}}]
[null,{"$f":"RÉSUMÉ!A6","v":"2005-2006"},{"$f":"RÉSUMÉ!B6","v":{"$error":"#REF!"}},{"$f":"RÉSUMÉ!C6","v":0},{"$f":"RÉSUMÉ!D6","v":{"$error":"#REF!"}},{"$f":"RÉSUMÉ!E6","v":0},{"$f":"RÉSUMÉ!F6","v":0},{"$f":"RÉSUMÉ!G6","v":0},{"$f":"RÉSUMÉ!H6","v":{"$error":"#REF!"}},{"$f":"RÉSUMÉ!I6","v":0},{"$f":"RÉSUMÉ!J6","v":0},{"$f":"RÉSUMÉ!K6","v":0},null,null,null,null,{"$f":"RÉSUMÉ!Q6","v":{"$error":"#REF!"}},{"$f":"RÉSUMÉ!R6","v":{"$error":"#REF!"}},null,null,null,null,null,{"$f":"RÉSUMÉ!S6","v":{"$error":"#REF!"}},{"$f":"RÉSUMÉ!T6","v":{"$error":"#REF!"}},null,null,null,null,null,{"$f":"RÉSUMÉ!U6","v":{"$error":"#REF!"}},{"$f":"RÉSUMÉ!V6","v":{"$error":"#REF!"}},null,null,null,null,null,{"$f":"RÉSUMÉ!W6","v":{"$error":"#REF!"}},{"$f":"RÉSUMÉ!X6","v":{"$error":"#REF!"}},null,null,null,null,null,{"$f":"RÉSUMÉ!Y6","v":0},{"$f":"RÉSUMÉ!Z6","v":0},null,null,null,null,null,{"$f":"RÉSUMÉ!AA6","v":{"$error":"#REF!"}},{"$f":"RÉSUMÉ!AB6","v":{"$error":"#REF!"}},null,null,null,null,null,{"$f":"RÉSUMÉ!AC6","v":{"$error":"#REF!"}},{"$f":"RÉSUMÉ!AD6","v":{"$error":"#REF!"}},null,null,null,null,null,{"$f":"RÉSUMÉ!AE6","v":{"$error":"#REF!"}},{"$f":"RÉSUMÉ!AF6","v":{"$error":"#REF!"}},null,null,null,null,null,{"$f":"RÉSUMÉ!AG6","v":0},{"$f":"RÉSUMÉ!AH6","v":0},null,null,null,null,null,{"$f":"RÉSUMÉ!AI6","v":0},{"$f":"RÉSUMÉ!AJ6","v":0},null,null,null,null,null,{"$f":"RÉSUMÉ!AK6","v":0},{"$f":"RÉSUMÉ!AL6","v":0},null,null,null,null,null,{"$f":"RÉSUMÉ!AM6","v":{"$error":"#REF!"}},{"$f":"RÉSUMÉ!AN6","v":0},{"$f":"RÉSUMÉ!AO6","v":0},{"$f":"RÉSUMÉ!AP6","v":0},{"$f":"RÉSUMÉ!AQ6","v":0},{"$f":"RÉSUMÉ!AR6","v":0},null,null,null,null,null,null,null,null,null,{"$f":"RÉSUMÉ!L6","v":0},{"$f":"RÉSUMÉ!M6","v":0},{"$f":"RÉSUMÉ!N6","v":0},{"$f":"RÉSUMÉ!O6","v":0},{"$f":"RÉSUMÉ!P6","v":{"$error":"#REF!"}}]
[null,{"$f":"RÉSUMÉ!A7","v":"2006-2007"},{"$f":"RÉSUMÉ!B7","v":{"$error":"#REF!"}},{"$f":"RÉSUMÉ!C7","v":0},{"$f":"RÉSUMÉ!D7","v":{"$error":"#REF!"}},{"$f":"RÉSUMÉ!E7","v":0},{"$f":"RÉSUMÉ!F7","v":0},{"$f":"RÉSUMÉ!G7","v":0},{"$f":"RÉSUMÉ!H7","v":{"$error":"#REF!"}},{"$f":"RÉSUMÉ!I7","v":0},{"$f":"RÉSUMÉ!J7","v":0},{"$f":"RÉSUMÉ!K7","v":0},null,null,null,null,{"$f":"RÉSUMÉ!Q7","v":{"$error":"#REF!"}},{"$f":"RÉSUMÉ!R7","v":{"$error":"#REF!"}},null,null,null,null,null,{"$f":"RÉSUMÉ!S7","v":{"$error":"#REF!"}},{"$f":"RÉSUMÉ!T7","v":{"$error":"#REF!"}},null,null,null,null,null,{"$f":"RÉSUMÉ!U7","v":{"$error":"#REF!"}},{"$f":"RÉSUMÉ!V7","v":{"$error":"#REF!"}},null,null,null,null,null,{"$f":"RÉSUMÉ!W7","v":{"$error":"#REF!"}},{"$f":"RÉSUMÉ!X7","v":{"$error":"#REF!"}},null,null,null,null,null,{"$f":"RÉSUMÉ!Y7","v":0},{"$f":"RÉSUMÉ!Z7","v":0},null,null,null,null,null,{"$f":"RÉSUMÉ!AA7","v":{"$error":"#REF!"}},{"$f":"RÉSUMÉ!AB7","v":{"$error":"#REF!"}},null,null,null,null,null,{"$f":"RÉSUMÉ!AC7","v":{"$error":"#REF!"}},{"$f":"RÉSUMÉ!AD7","v":{"$error":"#REF!"}},null,null,null,null,null,{"$f":"RÉSUMÉ!AE7","v":{"$error":"#REF!"}},{"$f":"RÉSUMÉ!AF7","v":{"$error":"#REF!"}},null,null,null,null,null,{"$f":"RÉSUMÉ!AG7","v":0},{"$f":"RÉSUMÉ!AH7","v":0},null,null,null,null,null,{"$f":"RÉSUMÉ!AI7","v":0},{"$f":"RÉSUMÉ!AJ7","v":0},null,null,null,null,null,{"$f":"RÉSUMÉ!AK7","v":0},{"$f":"RÉSUMÉ!AL7","v":0},null,null,null,null,null,{"$f":"RÉSUMÉ!AM7","v":{"$error":"#REF!"}},{"$f":"RÉSUMÉ!AN7","v":0},{"$f":"RÉSUMÉ!AO7","v":0},{"$f":"RÉSUMÉ!AP7","v":0},{"$f":"RÉSUMÉ!AQ7","v":0},{"$f":"RÉSUMÉ!AR7","v":0},null,null,null,null,null,null,null,null,null,{"$f":"RÉSUMÉ!L7","v":0},{"$f":"RÉSUMÉ!M7","v":0},{"$f":"RÉSUMÉ!N7","v":0},{"$f":"RÉSUMÉ!O7","v":0},{"$f":"RÉSUMÉ!P7","v":{"$error":"#REF!"}}]
[null,{"$f":"RÉSUMÉ!A8","v":"2007-2008"},{"$f":"RÉSUMÉ!B8","v":{"$error":"#REF!"}},{"$f":"RÉSUMÉ!C8","v":0},{"$f":"RÉSUMÉ!D8","v":{"$error":"#REF!"}},{"$f":"RÉSUMÉ!E8","v":0},{"$f":"RÉSUMÉ!F8","v":0},{"$f":"RÉSUMÉ!G8","v":0},{"$f":"RÉSUMÉ!H8","v":{"$error":"#REF!"}},{"$f":"RÉSUMÉ!I8","v":0},{"$f":"RÉSUMÉ!J8","v":0},{"$f":"RÉSUMÉ!K8","v":0},null,null,null,null,{"$f":"RÉSUMÉ!Q8","v":{"$error":"#REF!"}},{"$f":"RÉSUMÉ!R8","v":{"$error":"#REF!"}},null,null,null,null,null,{"$f":"RÉSUMÉ!S8","v":{"$error":"#REF!"}},{"$f":"RÉSUMÉ!T8","v":{"$error":"#REF!"}},null,null,null,null,null,{"$f":"RÉSUMÉ!U8","v":{"$error":"#REF!"}},{"$f":"RÉSUMÉ!V8","v":{"$error":"#REF!"}},null,null,null,null,null,{"$f":"RÉSUMÉ!W8","v":{"$error":"#REF!"}},{"$f":"RÉSUMÉ!X8","v":{"$error":"#REF!"}},null,null,null,null,null,{"$f":"RÉSUMÉ!Y8","v":0},{"$f":"RÉSUMÉ!Z8","v":0},null,null,null,null,null,{"$f":"RÉSUMÉ!AA8","v":{"$error":"#REF!"}},{"$f":"RÉSUMÉ!AB8","v":{"$error":"#REF!"}},null,null,null,null,null,{"$f":"RÉSUMÉ!AC8","v":{"$error":"#REF!"}},{"$f":"RÉSUMÉ!AD8","v":{"$error":"#REF!"}},null,null,null,null,null,{"$f":"RÉSUMÉ!AE8","v":{"$error":"#REF!"}},{"$f":"RÉSUMÉ!AF8","v":{"$error":"#REF!"}},null,null,null,null,null,{"$f":"RÉSUMÉ!AG8","v":0},{"$f":"RÉSUMÉ!AH8","v":0},null,null,null,null,null,{"$f":"RÉSUMÉ!AI8","v":0},{"$f":"RÉSUMÉ!AJ8","v":0},null,null,null,null,null,{"$f":"RÉSUMÉ!AK8","v":0},{"$f":"RÉSUMÉ!AL8","v":0},null,null,null,null,null,{"$f":"RÉSUMÉ!AM8","v":{"$error":"#REF!"}},{"$f":"RÉSUMÉ!AN8","v":0},{"$f":"RÉSUMÉ!AO8","v":0},{"$f":"RÉSUMÉ!AP8","v":0},{"$f":"RÉSUMÉ!AQ8","v":0},{"$f":"RÉSUMÉ!AR8","v":0},null,null,null,null,null,null,null,null,null,{"$f":"RÉSUMÉ!L8","v":0},{"$f":"RÉSUMÉ!M8","v":0},{"$f":"RÉSUMÉ!N8","v":0},{"$f":"RÉSUMÉ!O8","v":0},{"$f":"RÉSUMÉ!P8","v":{"$error":"#REF!"}}]
[null,{"$f":"RÉSUMÉ!A9","v":"2008-2009"},{"$f":"RÉSUMÉ!B9","v":{"$error":"#REF!"}},{"$f":"RÉSUMÉ!C9","v":0},{"$f":"RÉSUMÉ!D9","v":{"$error":"#REF!"}},{"$f":"RÉSUMÉ!E9","v":0},{"$f":"RÉSUMÉ!F9","v":0},{"$f":"RÉSUMÉ!G9","v":0},{"$f":"RÉSUMÉ!H9","v":{"$error":"#REF!"}},{"$f":"RÉSUMÉ!I9","v":0},{"$f":"RÉSUMÉ!J9","v":0},{"$f":"RÉSUMÉ!K9","v":0},null,null,null,null,{"$f":"RÉSUMÉ!Q9","v":{"$error":"#REF!"}},{"$f":"RÉSUMÉ!R9","v":{"$error":"#REF!"}},null,null,null,null,null,{"$f":"RÉSUMÉ!S9","v":{"$error":"#REF!"}},{"$f":"RÉSUMÉ!T9","v":{"$error":"#REF!"}},null,null,null,null,null,{"$f":"RÉSUMÉ!U9","v":{"$error":"#REF!"}},{"$f":"RÉSUMÉ!V9","v":{"$error":"#REF!"}},null,null,null,null,null,{"$f":"RÉSUMÉ!W9","v":{"$error":"#REF!"}},{"$f":"RÉSUMÉ!X9","v":{"$error":"#REF!"}},null,null,null,null,null,{"$f":"RÉSUMÉ!Y9","v":0},{"$f":"RÉSUMÉ!Z9","v":0},null,null,null,null,null,{"$f":"RÉSUMÉ!AA9","v":{"$error":"#REF!"}},{"$f":"RÉSUMÉ!AB9","v":{"$error":"#REF!"}},null,null,null,null,null,{"$f":"RÉSUMÉ!AC9","v":{"$error":"#REF!"}},{"$f":"RÉSUMÉ!AD9","v":{"$error":"#REF!"}},null,null,null,null,null,{"$f":"RÉSUMÉ!AE9","v":{"$error":"#REF!"}},{"$f":"RÉSUMÉ!AF9","v":{"$error":"#REF!"}},null,null,null,null,null,{"$f":"RÉSUMÉ!AG9","v":0},{"$f":"RÉSUMÉ!AH9","v":0},null,null,null,null,null,{"$f":"RÉSUMÉ!AI9","v":0},{"$f":"RÉSUMÉ!AJ9","v":0},null,null,null,null,null,{"$f":"RÉSUMÉ!AK9","v":0},{"$f":"RÉSUMÉ!AL9","v":0},null,null,null,null,null,{"$f":"RÉSUMÉ!AM9","v":{"$error":"#REF!"}},{"$f":"RÉSUMÉ!AN9","v":0},{"$f":"RÉSUMÉ!AO9","v":0},{"$f":"RÉSUMÉ!AP9","v":0},{"$f":"RÉSUMÉ!AQ9","v":0},{"$f":"RÉSUMÉ!AR9","v":0},null,null,null,null,null,null,null,null,null,{"$f":"RÉSUMÉ!L9","v":0},{"$f":"RÉSUMÉ!M9","v":0},{"$f":"RÉSUMÉ!N9","v":0},{"$f":"RÉSUMÉ!O9","v":0},{"$f":"RÉSUMÉ!P9","v":{"$error":"#REF!"}}]
[null,{"$f":"RÉSUMÉ!A10","v":"2009-2010"},{"$f":"RÉSUMÉ!B10","v":0},{"$f":"RÉSUMÉ!C10","v":0},{"$f":"RÉSUMÉ!D10","v":0},{"$f":"RÉSUMÉ!E10","v":0},{"$f":"RÉSUMÉ!F10","v":0},{"$f":"RÉSUMÉ!G10","v":0},{"$f":"RÉSUMÉ!H10","v":0},{"$f":"RÉSUMÉ!I10","v":0},{"$f":"RÉSUMÉ!J10","v":0},{"$f":"RÉSUMÉ!K10","v":0},null,null,null,null,{"$f":"RÉSUMÉ!Q10","v":0},{"$f":"RÉSUMÉ!R10","v":0},null,null,null,null,null,{"$f":"RÉSUMÉ!S10","v":0},{"$f":"RÉSUMÉ!T10","v":0},null,null,null,null,null,{"$f":"RÉSUMÉ!U10","v":0},{"$f":"RÉSUMÉ!V10","v":0},null,null,null,null,null,{"$f":"RÉSUMÉ!W10","v":0},{"$f":"RÉSUMÉ!X10","v":0},null,null,null,null,null,{"$f":"RÉSUMÉ!Y10","v":0},{"$f":"RÉSUMÉ!Z10","v":0},null,null,null,null,null,{"$f":"RÉSUMÉ!AA10","v":0},{"$f":"RÉSUMÉ!AB10","v":0},null,null,null,null,null,{"$f":"RÉSUMÉ!AC10","v":0},{"$f":"RÉSUMÉ!AD10","v":0},null,null,null,null,null,{"$f":"RÉSUMÉ!AE10","v":0},{"$f":"RÉSUMÉ!AF10","v":0},null,null,null,null,null,{"$f":"RÉSUMÉ!AG10","v":0},{"$f":"RÉSUMÉ!AH10","v":0},null,null,null,null,null,{"$f":"RÉSUMÉ!AI10","v":0},{"$f":"RÉSUMÉ!AJ10","v":0},null,null,null,null,null,{"$f":"RÉSUMÉ!AK10","v":0},{"$f":"RÉSUMÉ!AL10","v":0},null,null,null,null,null,{"$f":"RÉSUMÉ!AM10","v":3967.8000000000006},{"$f":"RÉSUMÉ!AN10","v":0},{"$f":"RÉSUMÉ!AO10","v":0},{"$f":"RÉSUMÉ!AP10","v":0},{"$f":"RÉSUMÉ!AQ10","v":0},{"$f":"RÉSUMÉ!AR10","v":0},null,null,null,null,null,null,null,null,null,{"$f":"RÉSUMÉ!L10","v":0},{"$f":"RÉSUMÉ!M10","v":0},{"$f":"RÉSUMÉ!N10","v":0},{"$f":"RÉSUMÉ!O10","v":0},{"$f":"RÉSUMÉ!P10","v":0}]
[null,{"$f":"RÉSUMÉ!A11","v":"2010-2011"},{"$f":"RÉSUMÉ!B11","v":0},{"$f":"RÉSUMÉ!C11","v":0},{"$f":"RÉSUMÉ!D11","v":0},{"$f":"RÉSUMÉ!E11","v":0},{"$f":"RÉSUMÉ!F11","v":0},{"$f":"RÉSUMÉ!G11","v":0},{"$f":"RÉSUMÉ!H11","v":0},{"$f":"RÉSUMÉ!I11","v":0},{"$f":"RÉSUMÉ!J11","v":0},{"$f":"RÉSUMÉ!K11","v":0},null,null,null,null,{"$f":"RÉSUMÉ!Q11","v":0},{"$f":"RÉSUMÉ!R11","v":0},null,null,null,null,null,{"$f":"RÉSUMÉ!S11","v":0},{"$f":"RÉSUMÉ!T11","v":0},null,null,null,null,null,{"$f":"RÉSUMÉ!U11","v":0},{"$f":"RÉSUMÉ!V11","v":0},null,null,null,null,null,{"$f":"RÉSUMÉ!W11","v":0},{"$f":"RÉSUMÉ!X11","v":0},null,null,null,null,null,{"$f":"RÉSUMÉ!Y11","v":0},{"$f":"RÉSUMÉ!Z11","v":0},null,null,null,null,null,{"$f":"RÉSUMÉ!AA11","v":0},{"$f":"RÉSUMÉ!AB11","v":0},null,null,null,null,null,{"$f":"RÉSUMÉ!AC11","v":0},{"$f":"RÉSUMÉ!AD11","v":0},null,null,null,null,null,{"$f":"RÉSUMÉ!AE11","v":0},{"$f":"RÉSUMÉ!AF11","v":0},null,null,null,null,null,{"$f":"RÉSUMÉ!AG11","v":0},{"$f":"RÉSUMÉ!AH11","v":0},null,null,null,null,null,{"$f":"RÉSUMÉ!AI11","v":0},{"$f":"RÉSUMÉ!AJ11","v":0},null,null,null,null,null,{"$f":"RÉSUMÉ!AK11","v":0},{"$f":"RÉSUMÉ!AL11","v":0},null,null,null,null,null,{"$f":"RÉSUMÉ!AM11","v":4187.3999999999996},{"$f":"RÉSUMÉ!AN11","v":0},{"$f":"RÉSUMÉ!AO11","v":0},{"$f":"RÉSUMÉ!AP11","v":0},{"$f":"RÉSUMÉ!AQ11","v":0},{"$f":"RÉSUMÉ!AR11","v":0},null,null,null,null,null,null,null,null,null,{"$f":"RÉSUMÉ!L11","v":0},{"$f":"RÉSUMÉ!M11","v":0},{"$f":"RÉSUMÉ!N11","v":0},{"$f":"RÉSUMÉ!O11","v":0},{"$f":"RÉSUMÉ!P11","v":0}]
[null,{"$f":"RÉSUMÉ!A12","v":"2011-2012"},{"$f":"RÉSUMÉ!B12","v":0},{"$f":"RÉSUMÉ!C12","v":0},{"$f":"RÉSUMÉ!D12","v":0},{"$f":"RÉSUMÉ!E12","v":0},{"$f":"RÉSUMÉ!F12","v":0},{"$f":"RÉSUMÉ!G12","v":0},{"$f":"RÉSUMÉ!H12","v":0},{"$f":"RÉSUMÉ!I12","v":0},{"$f":"RÉSUMÉ!J12","v":0},{"$f":"RÉSUMÉ!K12","v":0},null,null,null,null,{"$f":"RÉSUMÉ!Q12","v":0},{"$f":"RÉSUMÉ!R12","v":0},null,null,null,null,null,{"$f":"RÉSUMÉ!S12","v":0},{"$f":"RÉSUMÉ!T12","v":0},null,null,null,null,null,{"$f":"RÉSUMÉ!U12","v":0},{"$f":"RÉSUMÉ!V12","v":0},null,null,null,null,null,{"$f":"RÉSUMÉ!W12","v":0},{"$f":"RÉSUMÉ!X12","v":0},null,null,null,null,null,{"$f":"RÉSUMÉ!Y12","v":0},{"$f":"RÉSUMÉ!Z12","v":0},null,null,null,null,null,{"$f":"RÉSUMÉ!AA12","v":0},{"$f":"RÉSUMÉ!AB12","v":0},null,null,null,null,null,{"$f":"RÉSUMÉ!AC12","v":0},{"$f":"RÉSUMÉ!AD12","v":0},null,null,null,null,null,{"$f":"RÉSUMÉ!AE12","v":0},{"$f":"RÉSUMÉ!AF12","v":0},null,null,null,null,null,{"$f":"RÉSUMÉ!AG12","v":0},{"$f":"RÉSUMÉ!AH12","v":0},null,null,null,null,null,{"$f":"RÉSUMÉ!AI12","v":0},{"$f":"RÉSUMÉ!AJ12","v":0},null,null,null,null,null,{"$f":"RÉSUMÉ!AK12","v":0},{"$f":"RÉSUMÉ!AL12","v":0},null,null,null,null,null,{"$f":"RÉSUMÉ!AM12","v":3730},{"$f":"RÉSUMÉ!AN12","v":0},{"$f":"RÉSUMÉ!AO12","v":0},{"$f":"RÉSUMÉ!AP12","v":0},{"$f":"RÉSUMÉ!AQ12","v":0},{"$f":"RÉSUMÉ!AR12","v":0},null,null,null,null,null,null,null,null,null,{"$f":"RÉSUMÉ!L12","v":0},{"$f":"RÉSUMÉ!M12","v":0},{"$f":"RÉSUMÉ!N12","v":0},{"$f":"RÉSUMÉ!O12","v":0},{"$f":"RÉSUMÉ!P12","v":0}]
[null,{"$f":"RÉSUMÉ!A13","v":"2012-2013"},{"$f":"RÉSUMÉ!B13","v":0},{"$f":"RÉSUMÉ!C13","v":0},{"$f":"RÉSUMÉ!D13","v":0},{"$f":"RÉSUMÉ!E13","v":0},{"$f":"RÉSUMÉ!F13","v":0},{"$f":"RÉSUMÉ!G13","v":0},{"$f":"RÉSUMÉ!H13","v":0},{"$f":"RÉSUMÉ!I13","v":0},{"$f":"RÉSUMÉ!J13","v":0},{"$f":"RÉSUMÉ!K13","v":0},null,null,null,null,{"$f":"RÉSUMÉ!Q13","v":0},{"$f":"RÉSUMÉ!R13","v":0},null,null,null,null,null,{"$f":"RÉSUMÉ!S13","v":0},{"$f":"RÉSUMÉ!T13","v":0},null,null,null,null,null,{"$f":"RÉSUMÉ!U13","v":0},{"$f":"RÉSUMÉ!V13","v":0},null,null,null,null,null,{"$f":"RÉSUMÉ!W13","v":0},{"$f":"RÉSUMÉ!X13","v":0},null,null,null,null,null,{"$f":"RÉSUMÉ!Y13","v":0},{"$f":"RÉSUMÉ!Z13","v":0},null,null,null,null,null,{"$f":"RÉSUMÉ!AA13","v":0},{"$f":"RÉSUMÉ!AB13","v":0},null,null,null,null,null,{"$f":"RÉSUMÉ!AC13","v":0},{"$f":"RÉSUMÉ!AD13","v":0},null,null,null,null,null,{"$f":"RÉSUMÉ!AE13","v":0},{"$f":"RÉSUMÉ!AF13","v":0},null,null,null,null,null,{"$f":"RÉSUMÉ!AG13","v":0},{"$f":"RÉSUMÉ!AH13","v":0},null,null,null,null,null,{"$f":"RÉSUMÉ!AI13","v":0},{"$f":"RÉSUMÉ!AJ13","v":0},null,null,null,null,null,{"$f":"RÉSUMÉ!AK13","v":0},{"$f":"RÉSUMÉ!AL13","v":0},null,null,null,null,null,{"$f":"RÉSUMÉ!AM13","v":4039.4},{"$f":"RÉSUMÉ!AN13","v":0},{"$f":"RÉSUMÉ!AO13","v":0},{"$f":"RÉSUMÉ!AP13","v":0},{"$f":"RÉSUMÉ!AQ13","v":0},{"$f":"RÉSUMÉ!AR13","v":0},null,null,null,null,null,null,null,null,null,{"$f":"RÉSUMÉ!L13","v":0},{"$f":"RÉSUMÉ!M13","v":0},{"$f":"RÉSUMÉ!N13","v":0},{"$f":"RÉSUMÉ!O13","v":0},{"$f":"RÉSUMÉ!P13","v":0}]
[null,{"$f":"RÉSUMÉ!A14","v":"2013-2014"},{"$f":"RÉSUMÉ!B14","v":0},{"$f":"RÉSUMÉ!C14","v":0},{"$f":"RÉSUMÉ!D14","v":0},{"$f":"RÉSUMÉ!E14","v":0},{"$f":"RÉSUMÉ!F14","v":0},{"$f":"RÉSUMÉ!G14","v":0},{"$f":"RÉSUMÉ!H14","v":0},{"$f":"RÉSUMÉ!I14","v":0},{"$f":"RÉSUMÉ!J14","v":0},{"$f":"RÉSUMÉ!K14","v":0},null,null,null,null,{"$f":"RÉSUMÉ!Q14","v":0},{"$f":"RÉSUMÉ!R14","v":0},null,null,null,null,null,{"$f":"RÉSUMÉ!S14","v":0},{"$f":"RÉSUMÉ!T14","v":0},null,null,null,null,null,{"$f":"RÉSUMÉ!U14","v":0},{"$f":"RÉSUMÉ!V14","v":0},null,null,null,null,null,{"$f":"RÉSUMÉ!W14","v":0},{"$f":"RÉSUMÉ!X14","v":0},null,null,null,null,null,{"$f":"RÉSUMÉ!Y14","v":0},{"$f":"RÉSUMÉ!Z14","v":0},null,null,null,null,null,{"$f":"RÉSUMÉ!AA14","v":0},{"$f":"RÉSUMÉ!AB14","v":0},null,null,null,null,null,{"$f":"RÉSUMÉ!AC14","v":0},{"$f":"RÉSUMÉ!AD14","v":0},null,null,null,null,null,{"$f":"RÉSUMÉ!AE14","v":0},{"$f":"RÉSUMÉ!AF14","v":0},null,null,null,null,null,{"$f":"RÉSUMÉ!AG14","v":0},{"$f":"RÉSUMÉ!AH14","v":0},null,null,null,null,null,{"$f":"RÉSUMÉ!AI14","v":0},{"$f":"RÉSUMÉ!AJ14","v":0},null,null,null,null,null,{"$f":"RÉSUMÉ!AK14","v":0},{"$f":"RÉSUMÉ!AL14","v":0},null,null,null,null,null,{"$f":"RÉSUMÉ!AM14","v":4562.5},{"$f":"RÉSUMÉ!AN14","v":0},{"$f":"RÉSUMÉ!AO14","v":0},{"$f":"RÉSUMÉ!AP14","v":0},{"$f":"RÉSUMÉ!AQ14","v":0},{"$f":"RÉSUMÉ!AR14","v":0},null,null,null,null,null,null,null,null,null,{"$f":"RÉSUMÉ!L14","v":0},{"$f":"RÉSUMÉ!M14","v":0},{"$f":"RÉSUMÉ!N14","v":0},{"$f":"RÉSUMÉ!O14","v":0},{"$f":"RÉSUMÉ!P14","v":0}]
[null,{"$f":"RÉSUMÉ!A15","v":"2014-2015"},{"$f":"RÉSUMÉ!B15","v":0},{"$f":"RÉSUMÉ!C15","v":0},{"$f":"RÉSUMÉ!D15","v":0},{"$f":"RÉSUMÉ!E15","v":0},{"$f":"RÉSUMÉ!F15","v":0},{"$f":"RÉSUMÉ!G15","v":0},{"$f":"RÉSUMÉ!H15","v":0},{"$f":"RÉSUMÉ!I15","v":0},{"$f":"RÉSUMÉ!J15","v":0},{"$f":"RÉSUMÉ!K15","v":0},null,null,"x","x",{"$f":"RÉSUMÉ!Q15","v":0},{"$f":"RÉSUMÉ!R15","v":0},null,null,null,null,null,{"$f":"RÉSUMÉ!S15","v":0},{"$f":"RÉSUMÉ!T15","v":0},null,null,null,null,null,{"$f":"RÉSUMÉ!U15","v":0},{"$f":"RÉSUMÉ!V15","v":0},null,null,null,null,null,{"$f":"RÉSUMÉ!W15","v":0},{"$f":"RÉSUMÉ!X15","v":0},null,null,null,null,null,{"$f":"RÉSUMÉ!Y15","v":0},{"$f":"RÉSUMÉ!Z15","v":0},null,null,null,null,null,{"$f":"RÉSUMÉ!AA15","v":0},{"$f":"RÉSUMÉ!AB15","v":0},null,null,null,null,null,{"$f":"RÉSUMÉ!AC15","v":0},{"$f":"RÉSUMÉ!AD15","v":0},null,null,null,null,null,{"$f":"RÉSUMÉ!AE15","v":0},{"$f":"RÉSUMÉ!AF15","v":0},null,null,null,null,null,{"$f":"RÉSUMÉ!AG15","v":0},{"$f":"RÉSUMÉ!AH15","v":0},null,null,null,null,null,{"$f":"RÉSUMÉ!AI15","v":0},{"$f":"RÉSUMÉ!AJ15","v":0},null,null,null,null,null,{"$f":"RÉSUMÉ!AK15","v":0},{"$f":"RÉSUMÉ!AL15","v":0},null,null,null,null,null,{"$f":"RÉSUMÉ!AM15","v":4543.1000000000004},{"$f":"IF(RÉSUMÉ!AN15=FALSE,\"\",RÉSUMÉ!AN15)","v":""},{"$f":"IF(RÉSUMÉ!AO15=FALSE,\"\",RÉSUMÉ!AO15)","v":""},{"$f":"IF(RÉSUMÉ!AP15=FALSE,\"\",RÉSUMÉ!AP15)","v":""},{"$f":"IF(RÉSUMÉ!AQ15=FALSE,\"\",RÉSUMÉ!AQ15)","v":""},{"$f":"IF(RÉSUMÉ!AR15=FALSE,\"\",RÉSUMÉ!AR15)","v":""},null,null,null,null,null,null,null,null,null,{"$f":"RÉSUMÉ!L15","v":0},{"$f":"RÉSUMÉ!M15","v":0},{"$f":"RÉSUMÉ!N15","v":0},{"$f":"RÉSUMÉ!O15","v":0},{"$f":"RÉSUMÉ!P15","v":0}]
[null,{"$f":"RÉSUMÉ!A16","v":"2015-2016"},{"$f":"RÉSUMÉ!B16","v":0},{"$f":"RÉSUMÉ!C16","v":0},{"$f":"RÉSUMÉ!D16","v":0},{"$f":"RÉSUMÉ!E16","v":0},{"$f":"RÉSUMÉ!F16","v":0},{"$f":"RÉSUMÉ!G16","v":0},{"$f":"RÉSUMÉ!H16","v":0},{"$f":"RÉSUMÉ!I16","v":0},{"$f":"RÉSUMÉ!J16","v":0},{"$f":"RÉSUMÉ!K16","v":0},null,null,"x","x",{"$f":"RÉSUMÉ!Q16","v":0},{"$f":"RÉSUMÉ!R16","v":0},null,null,null,null,null,{"$f":"RÉSUMÉ!S16","v":0},{"$f":"RÉSUMÉ!T16","v":0},null,null,null,null,null,{"$f":"RÉSUMÉ!U16","v":0},{"$f":"RÉSUMÉ!V16","v":0},null,null,null,null,null,{"$f":"RÉSUMÉ!W16","v":0},{"$f":"RÉSUMÉ!X16","v":0},null,null,null,null,null,{"$f":"RÉSUMÉ!Y16","v":0},{"$f":"RÉSUMÉ!Z16","v":0},null,null,null,null,null,{"$f":"RÉSUMÉ!AA16","v":0},{"$f":"RÉSUMÉ!AB16","v":0},null,null,null,null,null,{"$f":"RÉSUMÉ!AC16","v":0},{"$f":"RÉSUMÉ!AD16","v":0},null,null,null,null,null,{"$f":"RÉSUMÉ!AE16","v":0},{"$f":"RÉSUMÉ!AF16","v":0},null,null,null,null,null,{"$f":"RÉSUMÉ!AG16","v":0},{"$f":"RÉSUMÉ!AH16","v":0},null,null,null,null,null,{"$f":"RÉSUMÉ!AI16","v":0},{"$f":"RÉSUMÉ!AJ16","v":0},null,null,null,null,null,{"$f":"RÉSUMÉ!AK16","v":0},{"$f":"RÉSUMÉ!AL16","v":0},null,null,null,null,null,{"$f":"RÉSUMÉ!AM16","v":3611.4000000000005},{"$f":"IF(RÉSUMÉ!AN16=FALSE,\"\",RÉSUMÉ!AN16)","v":""},{"$f":"IF(RÉSUMÉ!AO16=FALSE,\"\",RÉSUMÉ!AO16)","v":""},{"$f":"IF(RÉSUMÉ!AP16=FALSE,\"\",RÉSUMÉ!AP16)","v":""},{"$f":"IF(RÉSUMÉ!AQ16=FALSE,\"\",RÉSUMÉ!AQ16)","v":""},{"$f":"IF(RÉSUMÉ!AR16=FALSE,\"\",RÉSUMÉ!AR16)","v":""},null,null,null,null,null,null,null,null,null,{"$f":"RÉSUMÉ!L16","v":0},{"$f":"RÉSUMÉ!M16","v":0},{"$f":"RÉSUMÉ!N16","v":0},{"$f":"RÉSUMÉ!O16","v":0},{"$f":"RÉSUMÉ!P16","v":0}]
[null,{"$f":"RÉSUMÉ!A17","v":"2016-2017"},{"$f":"RÉSUMÉ!B17","v":0},{"$f":"RÉSUMÉ!C17","v":0},{"$f":"RÉSUMÉ!D17","v":0},{"$f":"RÉSUMÉ!E17","v":0},{"$f":"RÉSUMÉ!F17","v":0},{"$f":"RÉSUMÉ!G17","v":0},{"$f":"RÉSUMÉ!H17","v":0},{"$f":"RÉSUMÉ!I17","v":0},{"$f":"RÉSUMÉ!J17","v":0},{"$f":"RÉSUMÉ!K17","v":0},null,null,null,null,{"$f":"RÉSUMÉ!Q17","v":0},{"$f":"RÉSUMÉ!R17","v":0},null,null,null,null,null,{"$f":"RÉSUMÉ!S17","v":0},{"$f":"RÉSUMÉ!T17","v":0},null,null,null,null,null,{"$f":"RÉSUMÉ!U17","v":0},{"$f":"RÉSUMÉ!V17","v":0},null,null,null,null,null,{"$f":"RÉSUMÉ!W17","v":0},{"$f":"RÉSUMÉ!X17","v":0},null,null,null,null,null,{"$f":"RÉSUMÉ!Y17","v":0},{"$f":"RÉSUMÉ!Z17","v":0},null,null,null,null,null,{"$f":"RÉSUMÉ!AA17","v":0},{"$f":"RÉSUMÉ!AB17","v":0},null,null,null,null,null,{"$f":"RÉSUMÉ!AC17","v":0},{"$f":"RÉSUMÉ!AD17","v":0},null,null,null,null,null,{"$f":"RÉSUMÉ!AE17","v":0},{"$f":"RÉSUMÉ!AF17","v":0},null,null,null,null,null,{"$f":"RÉSUMÉ!AG17","v":0},{"$f":"RÉSUMÉ!AH17","v":0},null,null,null,null,null,{"$f":"RÉSUMÉ!AI17","v":0},{"$f":"RÉSUMÉ!AJ17","v":0},null,null,null,null,null,{"$f":"RÉSUMÉ!AK17","v":0},{"$f":"RÉSUMÉ!AL17","v":0},null,null,null,null,null,{"$f":"RÉSUMÉ!AM17","v":3951.9},{"$f":"IF(RÉSUMÉ!AN17=FALSE,\"\",RÉSUMÉ!AN17)","v":""},{"$f":"IF(RÉSUMÉ!AO17=FALSE,\"\",RÉSUMÉ!AO17)","v":""},{"$f":"IF(RÉSUMÉ!AP17=FALSE,\"\",RÉSUMÉ!AP17)","v":""},{"$f":"IF(RÉSUMÉ!AQ17=FALSE,\"\",RÉSUMÉ!AQ17)","v":""},{"$f":"IF(RÉSUMÉ!AR17=FALSE,\"\",RÉSUMÉ!AR17)","v":""},null,null,null,null,null,null,null,null,null,{"$f":"RÉSUMÉ!L17","v":0},{"$f":"RÉSUMÉ!M17","v":0},{"$f":"RÉSUMÉ!N17","v":0},{"$f":"RÉSUMÉ!O17","v":0},{"$f":"RÉSUMÉ!P17","v":0}]
[null,{"$f":"RÉSUMÉ!A18","v":"2017-2018"},{"$f":"RÉSUMÉ!B18","v":0},{"$f":"RÉSUMÉ!C18","v":0},{"$f":"RÉSUMÉ!D18","v":0},{"$f":"RÉSUMÉ!E18","v":0},{"$f":"RÉSUMÉ!F18","v":0},{"$f":"RÉSUMÉ!G18","v":0},{"$f":"RÉSUMÉ!H18","v":0},{"$f":"RÉSUMÉ!I18","v":0},{"$f":"RÉSUMÉ!J18","v":0},{"$f":"RÉSUMÉ!K18","v":0},null,null,null,null,{"$f":"RÉSUMÉ!Q18","v":0},{"$f":"RÉSUMÉ!R18","v":0},null,null,null,null,null,{"$f":"RÉSUMÉ!S18","v":0},{"$f":"RÉSUMÉ!T18","v":0},null,null,null,null,null,{"$f":"RÉSUMÉ!U18","v":0},{"$f":"RÉSUMÉ!V18","v":0},null,null,null,null,null,{"$f":"RÉSUMÉ!W18","v":0},{"$f":"RÉSUMÉ!X18","v":0},null,null,null,null,null,{"$f":"RÉSUMÉ!Y18","v":0},{"$f":"RÉSUMÉ!Z18","v":0},null,null,null,null,null,{"$f":"RÉSUMÉ!AA18","v":0},{"$f":"RÉSUMÉ!AB18","v":0},null,null,null,null,null,{"$f":"RÉSUMÉ!AC18","v":0},{"$f":"RÉSUMÉ!AD18","v":0},null,null,null,null,null,{"$f":"RÉSUMÉ!AE18","v":0},{"$f":"RÉSUMÉ!AF18","v":0},null,null,null,null,null,{"$f":"RÉSUMÉ!AG18","v":0},{"$f":"RÉSUMÉ!AH18","v":0},null,null,null,null,null,{"$f":"RÉSUMÉ!AI18","v":0},{"$f":"RÉSUMÉ!AJ18","v":0},null,null,null,null,null,{"$f":"RÉSUMÉ!AK18","v":0},{"$f":"RÉSUMÉ!AL18","v":0},null,null,null,null,null,{"$f":"RÉSUMÉ!AM18","v":3949.4000000000005},{"$f":"IF(RÉSUMÉ!AN18=FALSE,\"\",RÉSUMÉ!AN18)","v":""},{"$f":"IF(RÉSUMÉ!AO18=FALSE,\"\",RÉSUMÉ!AO18)","v":""},{"$f":"IF(RÉSUMÉ!AP18=FALSE,\"\",RÉSUMÉ!AP18)","v":""},{"$f":"IF(RÉSUMÉ!AQ18=FALSE,\"\",RÉSUMÉ!AQ18)","v":""},{"$f":"IF(RÉSUMÉ!AR18=FALSE,\"\",RÉSUMÉ!AR18)","v":""},null,null,null,null,null,null,null,null,null,{"$f":"RÉSUMÉ!L18","v":0},{"$f":"RÉSUMÉ!M18","v":0},{"$f":"RÉSUMÉ!N18","v":0},{"$f":"RÉSUMÉ!O18","v":0},{"$f":"RÉSUMÉ!P18","v":0}]
[null,{"$f":"RÉSUMÉ!A19","v":"2018-2019"},{"$f":"RÉSUMÉ!B19","v":0},{"$f":"RÉSUMÉ!C19","v":0},{"$f":"RÉSUMÉ!D19","v":0},{"$f":"RÉSUMÉ!E19","v":0},{"$f":"RÉSUMÉ!F19","v":0},{"$f":"RÉSUMÉ!G19","v":0},{"$f":"RÉSUMÉ!H19","v":0},{"$f":"RÉSUMÉ!I19","v":0},{"$f":"RÉSUMÉ!J19","v":0},{"$f":"RÉSUMÉ!K19","v":0},null,null,null,null,{"$f":"RÉSUMÉ!Q19","v":0},{"$f":"RÉSUMÉ!R19","v":0},null,null,null,null,null,{"$f":"RÉSUMÉ!S19","v":0},{"$f":"RÉSUMÉ!T19","v":0},null,null,null,null,null,{"$f":"RÉSUMÉ!U19","v":0},{"$f":"RÉSUMÉ!V19","v":0},null,null,null,null,null,{"$f":"RÉSUMÉ!W19","v":0},{"$f":"RÉSUMÉ!X19","v":0},null,null,null,null,null,{"$f":"RÉSUMÉ!Y19","v":0},{"$f":"RÉSUMÉ!Z19","v":0},null,null,null,null,null,{"$f":"RÉSUMÉ!AA19","v":0},{"$f":"RÉSUMÉ!AB19","v":0},null,null,null,null,null,{"$f":"RÉSUMÉ!AC19","v":0},{"$f":"RÉSUMÉ!AD19","v":0},null,null,null,null,null,{"$f":"RÉSUMÉ!AE19","v":0},{"$f":"RÉSUMÉ!AF19","v":0},null,null,null,null,null,{"$f":"RÉSUMÉ!AG19","v":0},{"$f":"RÉSUMÉ!AH19","v":0},null,null,null,null,null,{"$f":"RÉSUMÉ!AI19","v":0},{"$f":"RÉSUMÉ!AJ19","v":0},null,null,null,null,null,{"$f":"RÉSUMÉ!AK19","v":0},{"$f":"RÉSUMÉ!AL19","v":0},null,null,null,null,null,{"$f":"RÉSUMÉ!AM19","v":4347.2000000000007},{"$f":"IF(RÉSUMÉ!AN19=FALSE,\"\",RÉSUMÉ!AN19)","v":""},{"$f":"IF(RÉSUMÉ!AO19=FALSE,\"\",RÉSUMÉ!AO19)","v":""},{"$f":"IF(RÉSUMÉ!AP19=FALSE,\"\",RÉSUMÉ!AP19)","v":""},{"$f":"IF(RÉSUMÉ!AQ19=FALSE,\"\",RÉSUMÉ!AQ19)","v":""},{"$f":"IF(RÉSUMÉ!AR19=FALSE,\"\",RÉSUMÉ!AR19)","v":""},null,null,null,null,null,null,null,null,null,{"$f":"RÉSUMÉ!L19","v":0},{"$f":"RÉSUMÉ!M19","v":0},{"$f":"RÉSUMÉ!N19","v":0},{"$f":"RÉSUMÉ!O19","v":0},{"$f":"RÉSUMÉ!P19","v":0}]
[null,{"$f":"RÉSUMÉ!A20","v":"2019-2020"},{"$f":"RÉSUMÉ!B20","v":0},{"$f":"RÉSUMÉ!C20","v":0},{"$f":"RÉSUMÉ!D20","v":0},{"$f":"RÉSUMÉ!E20","v":0},{"$f":"RÉSUMÉ!F20","v":0},{"$f":"RÉSUMÉ!G20","v":0},{"$f":"RÉSUMÉ!H20","v":0},{"$f":"RÉSUMÉ!I20","v":0},{"$f":"RÉSUMÉ!J20","v":0},{"$f":"RÉSUMÉ!K20","v":0},null,null,null,null,{"$f":"RÉSUMÉ!Q20","v":0},{"$f":"RÉSUMÉ!R20","v":0},null,null,null,null,null,{"$f":"RÉSUMÉ!S20","v":0},{"$f":"RÉSUMÉ!T20","v":0},null,null,null,null,null,{"$f":"RÉSUMÉ!U20","v":0},{"$f":"RÉSUMÉ!V20","v":0},null,null,null,null,null,{"$f":"RÉSUMÉ!W20","v":0},{"$f":"RÉSUMÉ!X20","v":0},null,null,null,null,null,{"$f":"RÉSUMÉ!Y20","v":0},{"$f":"RÉSUMÉ!Z20","v":0},null,null,null,null,null,{"$f":"RÉSUMÉ!AA20","v":0},{"$f":"RÉSUMÉ!AB20","v":0},null,null,null,null,null,{"$f":"RÉSUMÉ!AC20","v":0},{"$f":"RÉSUMÉ!AD20","v":0},null,null,null,null,null,{"$f":"RÉSUMÉ!AE20","v":0},{"$f":"RÉSUMÉ!AF20","v":0},null,null,null,null,null,{"$f":"RÉSUMÉ!AG20","v":0},{"$f":"RÉSUMÉ!AH20","v":0},null,null,null,null,null,{"$f":"RÉSUMÉ!AI20","v":0},{"$f":"RÉSUMÉ!AJ20","v":0},null,null,null,null,null,{"$f":"RÉSUMÉ!AK20","v":0},{"$f":"RÉSUMÉ!AL20","v":0},null,null,null,null,null,{"$f":"RÉSUMÉ!AM20","v":4105.7},{"$f":"IF(RÉSUMÉ!AN20=FALSE,\"\",RÉSUMÉ!AN20)","v":""},{"$f":"IF(RÉSUMÉ!AO20=FALSE,\"\",RÉSUMÉ!AO20)","v":""},{"$f":"IF(RÉSUMÉ!AP20=FALSE,\"\",RÉSUMÉ!AP20)","v":""},{"$f":"IF(RÉSUMÉ!AQ20=FALSE,\"\",RÉSUMÉ!AQ20)","v":""},{"$f":"IF(RÉSUMÉ!AR20=FALSE,\"\",RÉSUMÉ!AR20)","v":""},null,null,null,null,null,null,null,null,null,{"$f":"RÉSUMÉ!L20","v":0},{"$f":"RÉSUMÉ!M20","v":0},{"$f":"RÉSUMÉ!N20","v":0},{"$f":"RÉSUMÉ!O20","v":0},{"$f":"RÉSUMÉ!P20","v":0}]
[null,{"$f":"RÉSUMÉ!A21","v":"2020-2021"},{"$f":"RÉSUMÉ!B21","v":0},{"$f":"RÉSUMÉ!C21","v":0},{"$f":"RÉSUMÉ!D21","v":0},{"$f":"RÉSUMÉ!E21","v":0},{"$f":"RÉSUMÉ!F21","v":0},{"$f":"RÉSUMÉ!G21","v":0},{"$f":"RÉSUMÉ!H21","v":{"$error":"#NAME?"}},{"$f":"RÉSUMÉ!I21","v":0},{"$f":"RÉSUMÉ!J21","v":0},{"$f":"RÉSUMÉ!K21","v":0},null,null,null,null,{"$f":"RÉSUMÉ!Q21","v":0},{"$f":"RÉSUMÉ!R21","v":0},null,null,null,null,null,{"$f":"RÉSUMÉ!S21","v":0},{"$f":"RÉSUMÉ!T21","v":0},null,null,null,null,null,{"$f":"RÉSUMÉ!U21","v":0},{"$f":"RÉSUMÉ!V21","v":0},null,null,null,null,null,{"$f":"RÉSUMÉ!W21","v":0},{"$f":"RÉSUMÉ!X21","v":0},null,null,null,null,null,{"$f":"RÉSUMÉ!Y21","v":0},{"$f":"RÉSUMÉ!Z21","v":0},null,null,null,null,null,{"$f":"RÉSUMÉ!AA21","v":0},{"$f":"RÉSUMÉ!AB21","v":0},null,null,null,null,null,{"$f":"RÉSUMÉ!AC21","v":0},{"$f":"RÉSUMÉ!AD21","v":0},null,null,null,null,null,{"$f":"RÉSUMÉ!AE21","v":0},{"$f":"RÉSUMÉ!AF21","v":0},null,null,null,null,null,{"$f":"RÉSUMÉ!AG21","v":0},{"$f":"RÉSUMÉ!AH21","v":0},null,null,null,null,null,{"$f":"RÉSUMÉ!AI21","v":0},{"$f":"RÉSUMÉ!AJ21","v":0},null,null,null,null,null,{"$f":"RÉSUMÉ!AK21","v":0},{"$f":"RÉSUMÉ!AL21","v":0},null,null,null,null,null,{"$f":"RÉSUMÉ!AM21","v":998.40000000000009},{"$f":"IF(RÉSUMÉ!AN21=FALSE,\"\",RÉSUMÉ!AN21)","v":""},{"$f":"IF(RÉSUMÉ!AO21=FALSE,\"\",RÉSUMÉ!AO21)","v":""},{"$f":"IF(RÉSUMÉ!AP21=FALSE,\"\",RÉSUMÉ!AP21)","v":""},{"$f":"IF(RÉSUMÉ!AQ21=FALSE,\"\",RÉSUMÉ!AQ21)","v":""},{"$f":"IF(RÉSUMÉ!AR21=FALSE,\"\",RÉSUMÉ!AR21)","v":""},null,null,null,null,null,null,null,null,null,{"$f":"RÉSUMÉ!L21","v":0},{"$f":"RÉSUMÉ!M21","v":0},{"$f":"RÉSUMÉ!N21","v":{"$error":"#NAME?"}},{"$f":"RÉSUMÉ!O21","v":0},{"$f":"RÉSUMÉ!P21","v":0}]
[null,{"$f":"RÉSUMÉ!A22","v":"2021-2022"},{"$f":"RÉSUMÉ!B22","v":0},{"$f":"RÉSUMÉ!C22","v":0},{"$f":"RÉSUMÉ!D22","v":0},{"$f":"RÉSUMÉ!E22","v":0},{"$f":"RÉSUMÉ!F22","v":0},{"$f":"RÉSUMÉ!G22","v":0},{"$f":"RÉSUMÉ!H22","v":{"$error":"#NAME?"}},{"$f":"RÉSUMÉ!I22","v":0},{"$f":"RÉSUMÉ!J22","v":0},{"$f":"RÉSUMÉ!K22","v":0},null,null,null,null,{"$f":"RÉSUMÉ!Q22","v":0},{"$f":"RÉSUMÉ!R22","v":0},null,null,null,null,null,{"$f":"RÉSUMÉ!S22","v":0},{"$f":"RÉSUMÉ!T22","v":0},null,null,null,null,null,{"$f":"RÉSUMÉ!U22","v":0},{"$f":"RÉSUMÉ!V22","v":0},null,null,null,null,null,{"$f":"RÉSUMÉ!W22","v":0},{"$f":"RÉSUMÉ!X22","v":0},null,null,null,null,null,{"$f":"RÉSUMÉ!Y22","v":0},{"$f":"RÉSUMÉ!Z22","v":0},null,null,null,null,null,{"$f":"RÉSUMÉ!AA22","v":0},{"$f":"RÉSUMÉ!AB22","v":0},null,null,null,null,null,{"$f":"RÉSUMÉ!AC22","v":0},{"$f":"RÉSUMÉ!AD22","v":0},null,null,null,null,null,{"$f":"RÉSUMÉ!AE22","v":0},{"$f":"RÉSUMÉ!AF22","v":0},null,null,null,null,null,{"$f":"RÉSUMÉ!AG22","v":0},{"$f":"RÉSUMÉ!AH22","v":0},null,null,null,null,null,{"$f":"RÉSUMÉ!AI22","v":0},{"$f":"RÉSUMÉ!AJ22","v":0},null,null,null,null,null,{"$f":"RÉSUMÉ!AK22","v":0},{"$f":"RÉSUMÉ!AL22","v":0},null,null,null,null,null,{"$f":"RÉSUMÉ!AM22","v":998.40000000000009},{"$f":"IF(RÉSUMÉ!AN22=FALSE,\"\",RÉSUMÉ!AN22)","v":""},{"$f":"IF(RÉSUMÉ!AO22=FALSE,\"\",RÉSUMÉ!AO22)","v":""},{"$f":"IF(RÉSUMÉ!AP22=FALSE,\"\",RÉSUMÉ!AP22)","v":""},{"$f":"IF(RÉSUMÉ!AQ22=FALSE,\"\",RÉSUMÉ!AQ22)","v":""},{"$f":"IF(RÉSUMÉ!AR22=FALSE,\"\",RÉSUMÉ!AR22)","v":""},null,null,null,null,null,null,null,null,null,{"$f":"RÉSUMÉ!L22","v":0},{"$f":"RÉSUMÉ!M22","v":0},{"$f":"RÉSUMÉ!N22","v":{"$error":"#NAME?"}},{"$f":"RÉSUMÉ!O22","v":0},{"$f":"RÉSUMÉ!P22","v":0}]
[null,{"$f":"RÉSUMÉ!A23","v":"2022-2023"},{"$f":"RÉSUMÉ!B23","v":0},{"$f":"RÉSUMÉ!C23","v":0},{"$f":"RÉSUMÉ!D23","v":0},{"$f":"RÉSUMÉ!E23","v":0},{"$f":"RÉSUMÉ!F23","v":0},{"$f":"RÉSUMÉ!G23","v":0},{"$f":"RÉSUMÉ!H23","v":{"$error":"#NAME?"}},{"$f":"RÉSUMÉ!I23","v":0},{"$f":"RÉSUMÉ!J23","v":0},{"$f":"RÉSUMÉ!K23","v":0},null,null,null,null,{"$f":"RÉSUMÉ!Q23","v":0},{"$f":"RÉSUMÉ!R23","v":0},null,null,null,null,null,{"$f":"RÉSUMÉ!S23","v":0},{"$f":"RÉSUMÉ!T23","v":0},null,null,null,null,null,{"$f":"RÉSUMÉ!U23","v":0},{"$f":"RÉSUMÉ!V23","v":0},null,null,null,null,null,{"$f":"RÉSUMÉ!W23","v":0},{"$f":"RÉSUMÉ!X23","v":0},null,null,null,null,null,{"$f":"RÉSUMÉ!Y23","v":0},{"$f":"RÉSUMÉ!Z23","v":0},null,null,null,null,null,{"$f":"RÉSUMÉ!AA23","v":0},{"$f":"RÉSUMÉ!AB23","v":0},null,null,null,null,null,{"$f":"RÉSUMÉ!AC23","v":0},{"$f":"RÉSUMÉ!AD23","v":0},null,null,null,null,null,{"$f":"RÉSUMÉ!AE23","v":0},{"$f":"RÉSUMÉ!AF23","v":0},null,null,null,null,null,{"$f":"RÉSUMÉ!AG23","v":0},{"$f":"RÉSUMÉ!AH23","v":0},null,null,null,null,null,{"$f":"RÉSUMÉ!AI23","v":0},{"$f":"RÉSUMÉ!AJ23","v":0},null,null,null,null,null,{"$f":"RÉSUMÉ!AK23","v":0},{"$f":"RÉSUMÉ!AL23","v":0},null,null,null,null,null,{"$f":"RÉSUMÉ!AM23","v":998.40000000000009},{"$f":"IF(RÉSUMÉ!AN23=FALSE,\"\",RÉSUMÉ!AN23)","v":""},{"$f":"IF(RÉSUMÉ!AO23=FALSE,\"\",RÉSUMÉ!AO23)","v":""},{"$f":"IF(RÉSUMÉ!AP23=FALSE,\"\",RÉSUMÉ!AP23)","v":""},{"$f":"IF(RÉSUMÉ!AQ23=FALSE,\"\",RÉSUMÉ!AQ23)","v":""},{"$f":"IF(RÉSUMÉ!AR23=FALSE,\"\",RÉSUMÉ!AR23)","v":""},null,null,null,null,null,null,null,null,null,{"$f":"RÉSUMÉ!L23","v":0},{"$f":"RÉSUMÉ!M23","v":0},{"$f":"RÉSUMÉ!N23","v":{"$error":"#NAME?"}},{"$f":"RÉSUMÉ!O23","v":0},{"$f":"RÉSUMÉ!P23","v":0}]
[null,{"$f":"RÉSUMÉ!A24","v":"2023-2024"},{"$f":"RÉSUMÉ!B24","v":0},{"$f":"RÉSUMÉ!C24","v":0},{"$f":"RÉSUMÉ!D24","v":0},{"$f":"RÉSUMÉ!E24","v":0},{"$f":"RÉSUMÉ!F24","v":0},{"$f":"RÉSUMÉ!G24","v":0},{"$f":"RÉSUMÉ!H24","v":{"$error":"#NAME?"}},{"$f":"RÉSUMÉ!I24","v":0},{"$f":"RÉSUMÉ!J24","v":0},{"$f":"RÉSUMÉ!K24","v":0},null,null,null,null,{"$f":"RÉSUMÉ!Q24","v":0},{"$f":"RÉSUMÉ!R24","v":0},null,null,null,null,null,{"$f":"RÉSUMÉ!S24","v":0},{"$f":"RÉSUMÉ!T24","v":0},null,null,null,null,null,{"$f":"RÉSUMÉ!U24","v":0},{"$f":"RÉSUMÉ!V24","v":0},null,null,null,null,null,{"$f":"RÉSUMÉ!W24","v":0},{"$f":"RÉSUMÉ!X24","v":0},null,null,null,null,null,{"$f":"RÉSUMÉ!Y24","v":0},{"$f":"RÉSUMÉ!Z24","v":0},null,null,null,null,null,{"$f":"RÉSUMÉ!AA24","v":0},{"$f":"RÉSUMÉ!AB24","v":0},null,null,null,null,null,{"$f":"RÉSUMÉ!AC24","v":0},{"$f":"RÉSUMÉ!AD24","v":0},null,null,null,null,null,{"$f":"RÉSUMÉ!AE24","v":0},{"$f":"RÉSUMÉ!AF24","v":0},null,null,null,null,null,{"$f":"RÉSUMÉ!AG24","v":0},{"$f":"RÉSUMÉ!AH24","v":0},null,null,null,null,null,{"$f":"RÉSUMÉ!AI24","v":0},{"$f":"RÉSUMÉ!AJ24","v":0},null,null,null,null,null,{"$f":"RÉSUMÉ!AK24","v":0},{"$f":"RÉSUMÉ!AL24","v":0},null,null,null,null,null,{"$f":"RÉSUMÉ!AM24","v":998.40000000000009},{"$f":"IF(RÉSUMÉ!AN24=FALSE,\"\",RÉSUMÉ!AN24)","v":""},{"$f":"IF(RÉSUMÉ!AO24=FALSE,\"\",RÉSUMÉ!AO24)","v":""},{"$f":"IF(RÉSUMÉ!AP24=FALSE,\"\",RÉSUMÉ!AP24)","v":""},{"$f":"IF(RÉSUMÉ!AQ24=FALSE,\"\",RÉSUMÉ!AQ24)","v":""},{"$f":"IF(RÉSUMÉ!AR24=FALSE,\"\",RÉSUMÉ!AR24)","v":""},null,null,null,null,null,null,null,null,null,{"$f":"RÉSUMÉ!L24","v":0},{"$f":"RÉSUMÉ!M24","v":0},{"$f":"RÉSUMÉ!N24","v":{"$error":"#NAME?"}},{"$f":"RÉSUMÉ!O24","v":0},{"$f":"RÉSUMÉ!P24","v":0}]
[null,{"$f":"RÉSUMÉ!A25","v":"2024-2025"},{"$f":"RÉSUMÉ!B25","v":0},{"$f":"RÉSUMÉ!C25","v":0},{"$f":"RÉSUMÉ!D25","v":0},{"$f":"RÉSUMÉ!E25","v":0},{"$f":"RÉSUMÉ!F25","v":0},{"$f":"RÉSUMÉ!G25","v":0},{"$f":"RÉSUMÉ!H25","v":{"$error":"#NAME?"}},{"$f":"RÉSUMÉ!I25","v":0},{"$f":"RÉSUMÉ!J25","v":0},{"$f":"RÉSUMÉ!K25","v":0},null,null,null,null,{"$f":"RÉSUMÉ!Q25","v":0},{"$f":"RÉSUMÉ!R25","v":0},null,null,null,null,null,{"$f":"RÉSUMÉ!S25","v":0},{"$f":"RÉSUMÉ!T25","v":0},null,null,null,null,null,{"$f":"RÉSUMÉ!U25","v":0},{"$f":"RÉSUMÉ!V25","v":0},null,null,null,null,null,{"$f":"RÉSUMÉ!W25","v":0},{"$f":"RÉSUMÉ!X25","v":0},null,null,null,null,null,{"$f":"RÉSUMÉ!Y25","v":0},{"$f":"RÉSUMÉ!Z25","v":0},null,null,null,null,null,{"$f":"RÉSUMÉ!AA25","v":0},{"$f":"RÉSUMÉ!AB25","v":0},null,null,null,null,null,{"$f":"RÉSUMÉ!AC25","v":0},{"$f":"RÉSUMÉ!AD25","v":0},null,null,null,null,null,{"$f":"RÉSUMÉ!AE25","v":0},{"$f":"RÉSUMÉ!AF25","v":0},null,null,null,null,null,{"$f":"RÉSUMÉ!AG25","v":0},{"$f":"RÉSUMÉ!AH25","v":0},null,null,null,null,null,{"$f":"RÉSUMÉ!AI25","v":0},{"$f":"RÉSUMÉ!AJ25","v":0},null,null,null,null,null,{"$f":"RÉSUMÉ!AK25","v":0},{"$f":"RÉSUMÉ!AL25","v":0},null,null,null,null,null,{"$f":"RÉSUMÉ!AM25","v":998.40000000000009},{"$f":"IF(RÉSUMÉ!AN25=FALSE,\"\",RÉSUMÉ!AN25)","v":""},{"$f":"IF(RÉSUMÉ!AO25=FALSE,\"\",RÉSUMÉ!AO25)","v":""},{"$f":"IF(RÉSUMÉ!AP25=FALSE,\"\",RÉSUMÉ!AP25)","v":""},{"$f":"IF(RÉSUMÉ!AQ25=FALSE,\"\",RÉSUMÉ!AQ25)","v":""},{"$f":"IF(RÉSUMÉ!AR25=FALSE,\"\",RÉSUMÉ!AR25)","v":""},null,null,null,null,null,null,null,null,null,{"$f":"RÉSUMÉ!L25","v":0},{"$f":"RÉSUMÉ!M25","v":0},{"$f":"RÉSUMÉ!N25","v":{"$error":"#NAME?"}},{"$f":"RÉSUMÉ!O25","v":0},{"$f":"RÉSUMÉ!P25","v":0}]
[null,{"$f":"RÉSUMÉ!A26","v":"2025-2026"},{"$f":"RÉSUMÉ!B26","v":0},{"$f":"RÉSUMÉ!C26","v":0},{"$f":"RÉSUMÉ!D26","v":0},{"$f":"RÉSUMÉ!E26","v":0},{"$f":"RÉSUMÉ!F26","v":0},{"$f":"RÉSUMÉ!G26","v":0},{"$f":"RÉSUMÉ!H26","v":{"$error":"#NAME?"}},{"$f":"RÉSUMÉ!I26","v":0},{"$f":"RÉSUMÉ!J26","v":0},{"$f":"RÉSUMÉ!K26","v":0},null,null,null,null,{"$f":"RÉSUMÉ!Q26","v":0},{"$f":"RÉSUMÉ!R26","v":0},null,null,null,null,null,{"$f":"RÉSUMÉ!S26","v":0},{"$f":"RÉSUMÉ!T26","v":0},null,null,null,null,null,{"$f":"RÉSUMÉ!U26","v":0},{"$f":"RÉSUMÉ!V26","v":0},null,null,null,null,null,{"$f":"RÉSUMÉ!W26","v":0},{"$f":"RÉSUMÉ!X26","v":0},null,null,null,null,null,{"$f":"RÉSUMÉ!Y26","v":0},{"$f":"RÉSUMÉ!Z26","v":0},null,null,null,null,null,{"$f":"RÉSUMÉ!AA26","v":0},{"$f":"RÉSUMÉ!AB26","v":0},null,null,null,null,null,{"$f":"RÉSUMÉ!AC26","v":0},{"$f":"RÉSUMÉ!AD26","v":0},null,null,null,null,null,{"$f":"RÉSUMÉ!AE26","v":0},{"$f":"RÉSUMÉ!AF26","v":0},null,null,null,null,null,{"$f":"RÉSUMÉ!AG26","v":0},{"$f":"RÉSUMÉ!AH26","v":0},null,null,null,null,null,{"$f":"RÉSUMÉ!AI26","v":0},{"$f":"RÉSUMÉ!AJ26","v":0},null,null,null,null,null,{"$f":"RÉSUMÉ!AK26","v":0},{"$f":"RÉSUMÉ!AL26","v":0},null,null,null,null,null,{"$f":"RÉSUMÉ!AM26","v":998.40000000000009},{"$f":"IF(RÉSUMÉ!AN26=FALSE,\"\",RÉSUMÉ!AN26)","v":""},{"$f":"IF(RÉSUMÉ!AO26=FALSE,\"\",RÉSUMÉ!AO26)","v":""},{"$f":"IF(RÉSUMÉ!AP26=FALSE,\"\",RÉSUMÉ!AP26)","v":""},{"$f":"IF(RÉSUMÉ!AQ26=FALSE,\"\",RÉSUMÉ!AQ26)","v":""},{"$f":"IF(RÉSUMÉ!AR26=FALSE,\"\",RÉSUMÉ!AR26)","v":""},null,null,null,null,null,null,null,null,null,{"$f":"RÉSUMÉ!L26","v":0},{"$f":"RÉSUMÉ!M26","v":0},{"$f":"RÉSUMÉ!N26","v":{"$error":"#NAME?"}},{"$f":"RÉSUMÉ!O26","v":0},{"$f":"RÉSUMÉ!P26","v":0}]
[null,{"$f":"RÉSUMÉ!A27","v":"2026-2027"},{"$f":"RÉSUMÉ!B27","v":0},{"$f":"RÉSUMÉ!C27","v":0},{"$f":"RÉSUMÉ!D27","v":0},{"$f":"RÉSUMÉ!E27","v":0},{"$f":"RÉSUMÉ!F27","v":0},{"$f":"RÉSUMÉ!G27","v":0},{"$f":"RÉSUMÉ!H27","v":{"$error":"#NAME?"}},{"$f":"RÉSUMÉ!I27","v":0},{"$f":"RÉSUMÉ!J27","v":0},{"$f":"RÉSUMÉ!K27","v":0},null,null,null,null,{"$f":"RÉSUMÉ!Q27","v":0},{"$f":"RÉSUMÉ!R27","v":0},null,null,null,null,null,{"$f":"RÉSUMÉ!S27","v":0},{"$f":"RÉSUMÉ!T27","v":0},null,null,null,null,null,{"$f":"RÉSUMÉ!U27","v":0},{"$f":"RÉSUMÉ!V27","v":0},null,null,null,null,null,{"$f":"RÉSUMÉ!W27","v":0},{"$f":"RÉSUMÉ!X27","v":0},null,null,null,null,null,{"$f":"RÉSUMÉ!Y27","v":0},{"$f":"RÉSUMÉ!Z27","v":0},null,null,null,null,null,{"$f":"RÉSUMÉ!AA27","v":0},{"$f":"RÉSUMÉ!AB27","v":0},null,null,null,null,null,{"$f":"RÉSUMÉ!AC27","v":0},{"$f":"RÉSUMÉ!AD27","v":0},null,null,null,null,null,{"$f":"RÉSUMÉ!AE27","v":0},{"$f":"RÉSUMÉ!AF27","v":0},null,null,null,null,null,{"$f":"RÉSUMÉ!AG27","v":0},{"$f":"RÉSUMÉ!AH27","v":0},null,null,null,null,null,{"$f":"RÉSUMÉ!AI27","v":0},{"$f":"RÉSUMÉ!AJ27","v":0},null,null,null,null,null,{"$f":"RÉSUMÉ!AK27","v":0},{"$f":"RÉSUMÉ!AL27","v":0},null,null,null,null,null,{"$f":"RÉSUMÉ!AM27","v":998.40000000000009},{"$f":"IF(RÉSUMÉ!AN27=FALSE,\"\",RÉSUMÉ!AN27)","v":""},{"$f":"IF(RÉSUMÉ!AO27=FALSE,\"\",RÉSUMÉ!AO27)","v":""},{"$f":"IF(RÉSUMÉ!AP27=FALSE,\"\",RÉSUMÉ!AP27)","v":""},{"$f":"IF(RÉSUMÉ!AQ27=FALSE,\"\",RÉSUMÉ!AQ27)","v":""},{"$f":"IF(RÉSUMÉ!AR27=FALSE,\"\",RÉSUMÉ!AR27)","v":""},null,null,null,null,null,null,null,null,null,{"$f":"RÉSUMÉ!L27","v":0},{"$f":"RÉSUMÉ!M27","v":0},{"$f":"RÉSUMÉ!N27","v":{"$error":"#NAME?"}},{"$f":"RÉSUMÉ!O27","v":0},{"$f":"RÉSUMÉ!P27","v":0}]
[null,{"$f":"RÉSUMÉ!A28","v":"2027-2028"},{"$f":"RÉSUMÉ!B28","v":0},{"$f":"RÉSUMÉ!C28","v":0},{"$f":"RÉSUMÉ!D28","v":0},{"$f":"RÉSUMÉ!E28","v":0},{"$f":"RÉSUMÉ!F28","v":0},{"$f":"RÉSUMÉ!G28","v":0},{"$f":"RÉSUMÉ!H28","v":{"$error":"#NAME?"}},{"$f":"RÉSUMÉ!I28","v":0},{"$f":"RÉSUMÉ!J28","v":0},{"$f":"RÉSUMÉ!K28","v":0},null,null,null,null,{"$f":"RÉSUMÉ!Q28","v":0},{"$f":"RÉSUMÉ!R28","v":0},null,null,null,null,null,{"$f":"RÉSUMÉ!S28","v":0},{"$f":"RÉSUMÉ!T28","v":0},null,null,null,null,null,{"$f":"RÉSUMÉ!U28","v":0},{"$f":"RÉSUMÉ!V28","v":0},null,null,null,null,null,{"$f":"RÉSUMÉ!W28","v":0},{"$f":"RÉSUMÉ!X28","v":0},null,null,null,null,null,{"$f":"RÉSUMÉ!Y28","v":0},{"$f":"RÉSUMÉ!Z28","v":0},null,null,null,null,null,{"$f":"RÉSUMÉ!AA28","v":0},{"$f":"RÉSUMÉ!AB28","v":0},null,null,null,null,null,{"$f":"RÉSUMÉ!AC28","v":0},{"$f":"RÉSUMÉ!AD28","v":0},null,null,null,null,null,{"$f":"RÉSUMÉ!AE28","v":0},{"$f":"RÉSUMÉ!AF28","v":0},null,null,null,null,null,{"$f":"RÉSUMÉ!AG28","v":0},{"$f":"RÉSUMÉ!AH28","v":0},null,null,null,null,null,{"$f":"RÉSUMÉ!AI28","v":0},{"$f":"RÉSUMÉ!AJ28","v":0},null,null,null,null,null,{"$f":"RÉSUMÉ!AK28","v":0},{"$f":"RÉSUMÉ!AL28","v":0},null,null,null,null,null,{"$f":"RÉSUMÉ!AM28","v":998.40000000000009},{"$f":"IF(RÉSUMÉ!AN28=FALSE,\"\",RÉSUMÉ!AN28)","v":""},{"$f":"IF(RÉSUMÉ!AO28=FALSE,\"\",RÉSUMÉ!AO28)","v":""},{"$f":"IF(RÉSUMÉ!AP28=FALSE,\"\",RÉSUMÉ!AP28)","v":""},{"$f":"IF(RÉSUMÉ!AQ28=FALSE,\"\",RÉSUMÉ!AQ28)","v":""},{"$f":"IF(RÉSUMÉ!AR28=FALSE,\"\",RÉSUMÉ!AR28)","v":""},null,null,null,null,null,null,null,null,null,{"$f":"RÉSUMÉ!L28","v":0},{"$f":"RÉSUMÉ!M28","v":0},{"$f":"RÉSUMÉ!N28","v":{"$error":"#NAME?"}},{"$f":"RÉSUMÉ!O28","v":0},{"$f":"RÉSUMÉ!P28","v":0}]
[null,{"$f":"RÉSUMÉ!A29","v":"2028-2029"},{"$f":"RÉSUMÉ!B29","v":0},{"$f":"RÉSUMÉ!C29","v":0},{"$f":"RÉSUMÉ!D29","v":0},{"$f":"RÉSUMÉ!E29","v":0},{"$f":"RÉSUMÉ!F29","v":0},{"$f":"RÉSUMÉ!G29","v":0},{"$f":"RÉSUMÉ!H29","v":{"$error":"#NAME?"}},{"$f":"RÉSUMÉ!I29","v":0},{"$f":"RÉSUMÉ!J29","v":0},{"$f":"RÉSUMÉ!K29","v":0},null,null,null,null,{"$f":"RÉSUMÉ!Q29","v":0},{"$f":"RÉSUMÉ!R29","v":0},null,null,null,null,null,{"$f":"RÉSUMÉ!S29","v":0},{"$f":"RÉSUMÉ!T29","v":0},null,null,null,null,null,{"$f":"RÉSUMÉ!U29","v":0},{"$f":"RÉSUMÉ!V29","v":0},null,null,null,null,null,{"$f":"RÉSUMÉ!W29","v":0},{"$f":"RÉSUMÉ!X29","v":0},null,null,null,null,null,{"$f":"RÉSUMÉ!Y29","v":0},{"$f":"RÉSUMÉ!Z29","v":0},null,null,null,null,null,{"$f":"RÉSUMÉ!AA29","v":0},{"$f":"RÉSUMÉ!AB29","v":0},null,null,null,null,null,{"$f":"RÉSUMÉ!AC29","v":0},{"$f":"RÉSUMÉ!AD29","v":0},null,null,null,null,null,{"$f":"RÉSUMÉ!AE29","v":0},{"$f":"RÉSUMÉ!AF29","v":0},null,null,null,null,null,{"$f":"RÉSUMÉ!AG29","v":0},{"$f":"RÉSUMÉ!AH29","v":0},null,null,null,null,null,{"$f":"RÉSUMÉ!AI29","v":0},{"$f":"RÉSUMÉ!AJ29","v":0},null,null,null,null,null,{"$f":"RÉSUMÉ!AK29","v":0},{"$f":"RÉSUMÉ!AL29","v":0},null,null,null,null,null,{"$f":"RÉSUMÉ!AM29","v":998.40000000000009},{"$f":"IF(RÉSUMÉ!AN29=FALSE,\"\",RÉSUMÉ!AN29)","v":""},{"$f":"IF(RÉSUMÉ!AO29=FALSE,\"\",RÉSUMÉ!AO29)","v":""},{"$f":"IF(RÉSUMÉ!AP29=FALSE,\"\",RÉSUMÉ!AP29)","v":""},{"$f":"IF(RÉSUMÉ!AQ29=FALSE,\"\",RÉSUMÉ!AQ29)","v":""},{"$f":"IF(RÉSUMÉ!AR29=FALSE,\"\",RÉSUMÉ!AR29)","v":""},null,null,null,null,null,null,null,null,null,{"$f":"RÉSUMÉ!L29","v":0},{"$f":"RÉSUMÉ!M29","v":0},{"$f":"RÉSUMÉ!N29","v":{"$error":"#NAME?"}},{"$f":"RÉSUMÉ!O29","v":0},{"$f":"RÉSUMÉ!P29","v":0}]
[null,{"$f":"RÉSUMÉ!A30","v":"2029-2030"},{"$f":"RÉSUMÉ!B30","v":0},{"$f":"RÉSUMÉ!C30","v":0},{"$f":"RÉSUMÉ!D30","v":0},{"$f":"RÉSUMÉ!E30","v":0},{"$f":"RÉSUMÉ!F30","v":0},{"$f":"RÉSUMÉ!G30","v":0},{"$f":"RÉSUMÉ!H30","v":{"$error":"#NAME?"}},{"$f":"RÉSUMÉ!I30","v":0},{"$f":"RÉSUMÉ!J30","v":0},{"$f":"RÉSUMÉ!K30","v":0},null,null,null,null,{"$f":"RÉSUMÉ!Q30","v":0},{"$f":"RÉSUMÉ!R30","v":0},null,null,null,null,null,{"$f":"RÉSUMÉ!S30","v":0},{"$f":"RÉSUMÉ!T30","v":0},null,null,null,null,null,{"$f":"RÉSUMÉ!U30","v":0},{"$f":"RÉSUMÉ!V30","v":0},null,null,null,null,null,{"$f":"RÉSUMÉ!W30","v":0},{"$f":"RÉSUMÉ!X30","v":0},null,null,null,null,null,{"$f":"RÉSUMÉ!Y30","v":0},{"$f":"RÉSUMÉ!Z30","v":0},null,null,null,null,null,{"$f":"RÉSUMÉ!AA30","v":0},{"$f":"RÉSUMÉ!AB30","v":0},null,null,null,null,null,{"$f":"RÉSUMÉ!AC30","v":0},{"$f":"RÉSUMÉ!AD30","v":0},null,null,null,null,null,{"$f":"RÉSUMÉ!AE30","v":0},{"$f":"RÉSUMÉ!AF30","v":0},null,null,null,null,null,{"$f":"RÉSUMÉ!AG30","v":0},{"$f":"RÉSUMÉ!AH30","v":0},null,null,null,null,null,{"$f":"RÉSUMÉ!AI30","v":0},{"$f":"RÉSUMÉ!AJ30","v":0},null,null,null,null,null,{"$f":"RÉSUMÉ!AK30","v":0},{"$f":"RÉSUMÉ!AL30","v":0},null,null,null,null,null,{"$f":"RÉSUMÉ!AM30","v":998.40000000000009},{"$f":"IF(RÉSUMÉ!AN30=FALSE,\"\",RÉSUMÉ!AN30)","v":""},{"$f":"IF(RÉSUMÉ!AO30=FALSE,\"\",RÉSUMÉ!AO30)","v":""},{"$f":"IF(RÉSUMÉ!AP30=FALSE,\"\",RÉSUMÉ!AP30)","v":""},{"$f":"IF(RÉSUMÉ!AQ30=FALSE,\"\",RÉSUMÉ!AQ30)","v":""},{"$f":"IF(RÉSUMÉ!AR30=FALSE,\"\",RÉSUMÉ!AR30)","v":""},null,null,null,null,null,null,null,null,null,{"$f":"RÉSUMÉ!L30","v":0},{"$f":"RÉSUMÉ!M30","v":0},{"$f":"RÉSUMÉ!N30","v":{"$error":"#NAME?"}},{"$f":"RÉSUMÉ!O30","v":0},{"$f":"RÉSUMÉ!P30","v":0}]
[]
[]
[]
[]
[]
[]
[]
[]
[]
[]
[null,null,null,null,null,null,null,null,null,null,null,null,null,null,"x",null,null,null,null,null,null,null,null,null,null,null,null,null,null,null,null,null,null,null,null,null,null,null,null,null,null,null,null,null,null,null,null,null,null,null,null,null,null,null,null,null,null,null,null,null,null,null,null,null,null,null,null,null,null,null,null,null,null,null,null,null,null,null,null,null,null,null,null,null,null,null,null,null,null,null,null,null,null,null,null,null,null,null,null,null,null,null,null,null,null,null,null,null,null,null,null,null,null,null,null,null,null,"PARC 2"]
["Identifiant (CodeMO+année)","Code du MO","Année","Acronyme","MO ou réseau","Statut du MO/Réseau","Année financière\nChoix possibles:\nJanvier-Décembre\nAvril-Mars\nMai-Avril\nJuillet-Juin","Critère d'inclusion et d'exclusion","Parc de bâtiment","Superficie\n[m2]","Nombre bâtiments","Superficie par bâtiment","Catégorie","Intensité MIN","Intensité MAX","Électricité \n[kWh]","Électricité \n[$]","Électricité \n[GJ]","Électricité\n[kg CO2]","Électricité\n[kg CH4]","Électricité\n[kg N2O]","GES Électricité\n[kg CO2 éq]","Gaz naturel \n[m³]","Gaz naturel \n[$]","Gaz naturel \n[GJ]","Gaz naturel \n[kg CO2]","Gaz naturel \n[kg CH4]","Gaz naturel \n[kg N2O]","GES Gaz naturel\n[kg CO2 éq]","Mazout 2 léger \n[L]","Mazout 2 léger\n [$]","Mazout 2 léger\n[GJ]","Mazout 2 léger\n[kg CO2]","Mazout 2 léger\n[kg CH4]","Mazout 2 léger\n[kg N2O]","GES Mazout 2 léger\n[kg CO2 éq]","Mazout 6 lourd \n[L]","Mazout 6 lourd \n[$]","Mazout 6 lourd\n[GJ]","Mazout 6 lourd\n[kg CO2]","Mazout 6 lourd\n[kg CH4]","Mazout 6 lourd\n[kg N2O]","GES Mazout 6 lourd\n[kg CO2 éq]","Diesel (génératrice)\n[L]","Diesel (génératrice)\n[$]","Diesel (génératrice)\n[GJ]","Diesel (génératrice)\n[kg CO2]","Diesel (génératrice)\n[kg CH4]","Diesel (génératrice)\n[kg N2O]","Diesel (génératrice)\n[kg CO2 éq]","Propane\n[L]","Propane\n[$]","Propane\n[GJ]","Propane\n[kg CO2]","Propane\n[kg CH4]","Propane\n[kg N2O]","GES Propane\n[kg CO2 éq]","Résidus de bois (8% d'humidité) \n[Kg]","Résidus de bois (8% d'humidité)\n[$]","Résidus de bois (8% d'humidité)\n[GJ]","Résidus de bois (8% d'humidité) \n[kg CO2]","Résidus de bois (8% d'humidité) \n[kg CH4]","Résidus de bois (8% d'humidité) \n[kg N2O]","Résidus de bois (8% d'humidité)\n[kg CO2 éq]","Résidus de bois (35% d'humidité)\n[Kg]","Résidus de bois (35% d'humidité) \n[$]","Résidus de bois (35% d'humidité)\n[GJ]","Résidus de bois (35% d'humidité)\n[kg CO2]","Résidus de bois (35% d'humidité)\n[kg CH4]","Résidus de bois (35% d'humidité) \n[kg N2O]","Résidus de bois (35% d'humidité)\n[kg CO2 éq]","Vapeur\n[lbs]","Vapeur\n[$]","Vapeur\n[GJ]","Vapeur\n[kg CO2]","Vapeur\n[kg CH4]","Vapeur\n[kg N2O]","Vapeur\n[kg CO2 éq]","Eau refroidie\n[MBTU]","Eau refroidie\n[$]","Eau refroidie\n[GJ]","Eau refroidie\n[kg CO2]","Eau refroidie\n[kg CH4]","Eau refroidie\n[kg N2O]","Eau refroidie\n[kg CO2 éq]","Eau chaude\n[MBTU]","Eau chaude\n[$]","Eau chaude\n[GJ]","Eau chaude\n[kg CO2]","Eau chaude\n[kg CH4]","Eau chaude\n[kg N2O]","Eau chaude\n[kg CO2 éq]","TOTAL Facture\n[$]","Coûts ajustés à l'année courante (2016-2017)\n[$]","Coûts comparatifs ajustés à l'année de référence (2009-2010)\n[$]","TOTAL Consommation\n[GJ brut]","TOTAL Dioxide de carbone\n[kg CO2]","TOTAL Méthane\n[kg CH4]","TOTAL Oxyde nitreux\n[kg N2O]","TOTAL GES\n[kg CO2 éq.]","Variation émissions GES p/r à\nannée précédente (%)","Variation émissions GES p/r\n2009-2010 (%)","DJC Année","Part du chauffage\n[35% par défaut]","Cons. norm. \n[GJ]","Coût unit. Brut\n[$/m²]","Consom. unit. brute \n[GJ/m²]","Consom. unit. norm\n[GJ/m²]","Variation GJ norm./m2 p/r l'année précédente","Variation GJ norm./m2 p/r 2012-2013\n[%]","TOTAL GES/m² \n[kg CO2 éq./m²]","Date de réception des données/ date de compilation des données par le MO",null,null,null,null,null,"Parc de bâtiment","Superficie\n[m2]","Nombre de bâtiments","Superficie par bâtiment","Catégorie","Intensité énerg. minimum","Intensité énerg. maximum","Électricité \n[kWh]","Électricité \n[$]","Électricité \n[GJ]","Électricité\n[kg CO2]","Électricité\n[kg CH4]","Électricité\n[kg N2O]","GES Électricité\n[kg CO2 éq]","Gaz naturel \n[m³]","Gaz naturel \n[$]","Gaz naturel \n[GJ]","Gaz naturel \n[kg CO2]","Gaz naturel \n[kg CH4]","Gaz naturel \n[kg N2O]","GES Gaz naturel\n[kg CO2 éq]","Mazout 2 léger \n[L]","Mazout 2 léger\n [$]","Mazout 2 léger\n[GJ]","Mazout 2 léger\n[kg CO2]","Mazout 2 léger\n[kg CH4]","Mazout 2 léger\n[kg N2O]","GES Mazout 2 léger\n[kg CO2 éq]","Mazout 6 lourd \n[L]","Mazout 6 lourd \n[$]","Mazout 6 lourd\n[GJ]","Mazout 6 lourd\n[kg CO2]","Mazout 6 lourd\n[kg CH4]","Mazout 6 lourd\n[kg N2O]","GES Mazout 6 lourd\n[kg CO2 éq]","Diesel (génératrice)\n[L]","Diesel (génératrice)\n[$]","Diesel (génératrice)\n[GJ]","Diesel (génératrice)\n[kg CO2]","Diesel (génératrice)\n[kg CH4]","Diesel (génératrice)\n[kg N2O]","Diesel (génératrice)\n[kg CO2 éq]","Propane\n[L]","Propane\n[$]","Propane\n[GJ]","Propane\n[kg CO2]","Propane\n[kg CH4]","Propane\n[kg N2O]","GES Propane\n[kg CO2 éq]","Résidus de bois (8% d'humidité) \n[Kg]","Résidus de bois (8% d'humidité)\n[$]","Résidus de bois (8% d'humidité)\n[GJ]","Résidus de bois (8% d'humidité) \n[kg CO2]","Résidus de bois (8% d'humidité) \n[kg CH4]","Résidus de bois (8% d'humidité) \n[kg N2O]","Résidus de bois (8% d'humidité)\n[kg CO2 éq]","Résidus de bois (35% d'humidité)\n[Kg]","Résidus de bois (35% d'humidité) \n[$]","Résidus de bois (35% d'humidité)\n[GJ]","Résidus de bois (35% d'humidité)\n[kg CO2]","Résidus de bois (35% d'humidité)\n[kg CH4]","Résidus de bois (35% d'humidité) \n[kg N2O]","Résidus de bois (35% d'humidité)\n[kg CO2 éq]","Vapeur\n[lbs]","Vapeur\n[$]","Vapeur\n[GJ]","Vapeur\n[kg CO2]","Vapeur\n[kg CH4]","Vapeur\n[kg N2O]","Vapeur\n[kg CO2 éq]","Eau refroidie\n[MBTU]","Eau refroidie\n[$]","Eau refroidie\n[GJ]","Eau refroidie\n[kg CO2]","Eau refroidie\n[kg CH4]","Eau refroidie\n[kg N2O]","Eau refroidie\n[kg CO2 éq]","Eau chaude\n[MBTU]","Eau chaude\n[$]","Eau chaude\n[GJ]","Eau chaude\n[kg CO2]","Eau chaude\n[kg CH4]","Eau chaude\n[kg N2O]","Eau chaude\n[kg CO2 éq]","TOTAL Facture\n[$]","Coûts ajustés à l'année courante (2016-2017)\n[$]","Coûts comparatifs ajustés à l'année de référence (2009-2010)\n[$]","TOTAL Consommation\n[GJ brut]","TOTAL Dioxide de carbone\n[kg CO2]","TOTAL Méthane\n[kg CH4]","TOTAL Oxyde nitreux\n[kg N2O]","TOTAL GES\n[kg CO2 éq.]","Variation émissions GES p/r à\nannée précédente (%)","Variation émissions GES p/r\n2009-2010 (%)","DJC Année","Part du chauffage\n[35% par défaut]","Cons. norm. \n[GJ]","Coût unit. Brut\n[$/m²]","Consom. unit. brute \n[GJ/m²]","Consom. unit. norm\n[GJ/m²]","Variation GJ norm./m2 p/r l'année précédente\n[%]","Variation GJ norm./m2 p/r 2012-2013\n[%]","TOTAL GES/m² \n[kg CO2 éq./m²]","Date de réception des données/ date de compilation des données par le MO"]
["ZONE TRANSITION:",null,null,null,null,null,null,null,null,null,null,null,null,null,null,null,null,null,null,null,null,null,null,null,null,null,null,null,null,null,null,null,null,null,null,null,null,null,null,null,null,null,null,null,null,null,null,null,null,null,null,null,null,null,null,null,null,null,null,null,null,null,null,null,null,null,null,null,null,null,null,null,null,null,null,null,null,null,null,null,null,null,null,null,null,null,null,null,null,null,null,null,null,null,null,"x"]
[]
[]
[]
[]
[]
[]
[]
[]
[]
[]
[]
[]
[]
[]
[]
[]
[]
[]
[]
[]
[]
[null,null,null,null,null,null,null,null,null,null,null,null,null,null,null,null,null,null,"IMPORT","Électricité \n[kWh]","Électricité \n[$]","Électricité \n[GJ]","Électricité\n[kg CO2]","Électricité\n[kg CH4]","Électricité\n[kg N2O]","GES Électricité\n[kg CO2 éq]","Gaz naturel \n[m³]","Gaz naturel \n[$]","Gaz naturel \n[GJ]","Gaz naturel \n[kg CO2]","Gaz naturel \n[kg CH4]","Gaz naturel \n[kg N2O]","GES Gaz naturel\n[kg CO2 éq]","Mazout 2 léger \n[L]","Mazout 2 léger\n [$]","Mazout 2 léger\n[GJ]","Mazout 2 léger\n[kg CO2]","Mazout 2 léger\n[kg CH4]","Mazout 2 léger\n[kg N2O]","GES Mazout 2 léger\n[kg CO2 éq]","Mazout 6 lourd \n[L]","Mazout 6 lourd \n[$]","Mazout 6 lourd\n[GJ]","Mazout 6 lourd\n[kg CO2]","Mazout 6 lourd\n[kg CH4]","Mazout 6 lourd\n[kg N2O]","GES Mazout 6 lourd\n[kg CO2 éq]","Diesel (génératrice)\n[L]","Diesel (génératrice)\n[$]","Diesel (génératrice)\n[GJ]","Diesel (génératrice)\n[kg CO2]","Diesel (génératrice)\n[kg CH4]","Diesel (génératrice)\n[kg N2O]","Diesel (génératrice)\n[kg CO2 éq]","Propane\n[L]","Propane\n[$]","Propane\n[GJ]","Propane\n[kg CO2]","Propane\n[kg CH4]","Propane\n[kg N2O]","GES Propane\n[kg CO2 éq]","Résidus de bois (8% d'humidité) \n[Kg]","Résidus de bois (8% d'humidité)\n[$]","Résidus de bois (8% d'humidité)\n[GJ]","Résidus de bois (8% d'humidité) \n[kg CO2]","Résidus de bois (8% d'humidité) \n[kg CH4]","Résidus de bois (8% d'humidité) \n[kg N2O]","Résidus de bois (8% d'humidité)\n[kg CO2 éq]","Résidus de bois (35% d'humidité)\n[Kg]","Résidus de bois (35% d'humidité) \n[$]","Résidus de bois (35% d'humidité)\n[GJ]","Résidus de bois (35% d'humidité)\n[kg CO2]","Résidus de bois (35% d'humidité)\n[kg CH4]","Résidus de bois (35% d'humidité) \n[kg N2O]","Résidus de bois (35% d'humidité)\n[kg CO2 éq]","Vapeur\n[lbs]","Vapeur\n[$]","Vapeur\n[GJ]","Vapeur\n[kg CO2]","Vapeur\n[kg CH4]","Vapeur\n[kg N2O]","Vapeur\n[kg CO2 éq]","Eau refroidie\n[MBTU]","Eau refroidie\n[$]","Eau refroidie\n[GJ]","Eau refroidie\n[kg CO2]","Eau refroidie\n[kg CH4]","Eau refroidie\n[kg N2O]","Eau refroidie\n[kg CO2 éq]","Eau chaude\n[MBTU]","Eau chaude\n[$]","Eau chaude\n[GJ]","Eau chaude\n[kg CO2]","Eau chaude\n[kg CH4]","Eau chaude\n[kg N2O]","Eau chaude\n[kg CO2 éq]"]

{"sheet":"Conversion","index":18,"n_rows":57,"n_cols":14,"rows_kept":57,"cut":false,"hidden":false,"merged":[[1,1,2,6]]}
[]
[null,"Table de conversion des différentes formes d'énergie utilisées dans les bâtiments \n(en vigueur depuis octobre 2016)"]
[]
[null,1,2,3,4,5,6]
[null,"Forme d'énergie","unité","MJ/unité","GJ/unité","kg CO2éq./unité","kg CO2éq./GJ"]
[null,"Électricité","kWh",{"$f":"F27","v":3.6},3.5999999999999999E-3,1.6000000000000001E-3,0.44400000000000001]
[null,"Gaz naturel","m³",37.89,3.789E-2,1.898355,50.101741884402216]
[null,"Mazout 2 léger","L",{"$f":"F30","v":38.799999999999997},{"$f":"G30","v":3.8799999999999994E-2},{"$f":"H30","v":2.7628879999999998},{"$f":"I30","v":71.208453608247424}]
[null,"Mazout 6 lourd","L",{"$f":"F32","v":42.5},{"$f":"G32","v":4.2500000000000003E-2},{"$f":"H32","v":3.1764970000000003},{"$f":"I32","v":74.74110588235294}]
[null,"Diesel (génératrice)","L",{"$f":"D8","v":38.799999999999997},{"$f":"E8","v":3.8799999999999994E-2},{"$f":"F8","v":2.7628879999999998},71.208453608247424]
[null,"Propane","L",{"$f":"F34","v":27.13},{"$f":"G34","v":2.7129999999999998E-2},{"$f":"H34","v":1.5477839999999998},{"$f":"I34","v":57.050645042388496}]
[null,"Résidus de bois (8% d'humidité)","kg (MG)",{"$f":"F36","v":17.406566399999999},{"$f":"G36","v":1.74065664E-2},{"$f":"H36","v":3.3857584831999993E-2},{"$f":"I36","v":1.9451041666666662}]
[null,"Résidus de bois (35% d'humidité)","kg (MG)",{"$f":"F38","v":11.353727999999998},{"$f":"G38","v":1.1353727999999999E-2},{"$f":"H38","v":2.2084183639999994E-2},{"$f":"I38","v":1.9451041666666664}]
[null,"Vapeur","Lbs",{"$f":"F42","v":1.5061428571428572},{"$f":"G42","v":1.5061428571428572E-3},{"$f":"H42","v":7.5460380669607516E-2},{"$f":"I42","v":50.101741884402223}]
[null,"Eau refroidie","MBTU",{"$f":"F40","v":211},0.21099999999999999,0.15238888888888888,0.72222222222222221]
[null,"Eau chaude","MBTU",1318.7499999999998,1.3187499999999999,66.071672110055417,50.101741884402216]
[null,"Références :","Les facteurs de conversion énergétique (GJ) et d'émissions de gaz à effet de serre (GES) proviennent du National Inventory Report 1990-2017: Greenhouse Gas Sources and Sinks in Canada [1], sauf pour les formes d'énergies suivantes :"]
[null,null,"Gaz naturel : le facteur de conversion énergétique correspond à la valeur normalisée par les distributeurs de gaz naturel au Québec, soit Énergir et Gazifère."]
[null,null,"Résidus de bois, éthanol et biodiesel : les facteurs de conversion énérgétique ont été élaborés à partir du Règlement sur la déclaration obligatoire de certaines émissions de contaminants dans l'atmosphère [2]."]
[null,null,"Vapeur, eau refroidie et eau chaude : les facteurs d'émission ont été déterminés à partir d'hypothèses élaborées par le MERN."]
[null,"Sources :","1. Environment and Climate Change Canada. 2019. National Inventory Report 1990-2017: Greenhouse Gas Sources and Sinks in Canada."]
[null,null,"2. Règlement sur la déclaration obligatoire de certaines émissions de contaminants dans l'atmosphère. Loi sur la qualité de l'environnement (chapitre Q-2, a. 2.2, 46.2, 115.27, 115.34 et 124.1)"]
[null,null,"Les références spécifiques peuvent être fournies sur demande."]
[null,"Note additionnelle :","Pour obtenir une tonne métrique de CO2 éq, il faut diviser la quantité de kilogrammes de CO2 éq par 1000."]
[]
["Source d'énergie - Unité de mesure",null,null,null,"unité","Énergie brute2 par unité (MJ)","Gigajoules brutes [GJ]/unité","GES [kg CO2]/unité","GES [kg CO2]/GJ"]
["Électricité",null,null,null,"kWh",3.6,3.5999999999999999E-3,1.6000000000000001E-3,0.44400000000000001,null,"facteurs de conversion"]
["Gaz naturel","Gaz naturel - m3",null,null,"m³",37.89,3.789E-2,1.898355,50.101741884402216,null,"m³","à","millier de pi³",3.5314669999999999E-2]
["Gaz naturel","Gaz naturel - Mille pi3",null,null,"millier de pi³",1072.9252177636092,1.0729252177636093,53.755422321658394,50.101741884402216,null,"litre","à","gal imp",0.2199692]
["Mazout 2 léger","Mazout no 2 - Litre",null,null,"L",38.799999999999997,3.8799999999999994E-2,2.7628879999999998,71.208453608247424,null,"1000 kg","à","1000 lbs",2.2046199999999998]
["Mazout 2 léger","Mazout no 2 - Gallon (imp.)",null,null,"gal imp",38.799999999999997,3.8799999999999994E-2,2.7628879999999998,71.208453608247424]
["Mazout 6 lourd","Mazout no 6 - Litre",null,null,"L",42.5,4.2500000000000003E-2,3.1764970000000003,74.74110588235294]
["Mazout 6 lourd","Mazout no 6 - Gallon (imp.)",null,null,"gal imp",42.5,4.2500000000000003E-2,3.1764970000000003,74.74110588235294]
["Propane","Gaz propane - Litre",null,null,"L",27.13,2.7129999999999998E-2,1.5477839999999998,57.050645042388496]
["Propane","Gaz propane - Gallon (imp.)",null,null,"gal imp",27.13,2.7129999999999998E-2,1.5477839999999998,57.050645042388496]
["Résidus de bois (8 % d'humidité)","Résidus de bois (8% d'humidité) - 1000kg (MG)",null,null,"kg",17.406566399999999,1.74065664E-2,3.3857584831999993E-2,1.9451041666666662]
["Résidus de bois (8 % d'humidité)","Résidus de bois (8% d'humidité) - 1000lbs",null,null,"1000 lbs",7.8954950966606505,7.8954950966606506E-3,1.5357560410410863E-2,1.945104166666666]
["Résidus de bois (35 % d'humidité)","Résidus de bois (35% d'humidité) - 1000kg (MG)",null,null,"kg",11.353727999999998,1.1353727999999999E-2,2.2084183639999994E-2,1.9451041666666664]
["Résidus de bois (35 % d'humidité)","Résidus de bois (35% d'humidité) - 1000lbs",null,null,"1000 lbs",5.1499705164608862,5.1499705164608865E-3,1.0017229109778555E-2,1.9451041666666666]
["Eau refroidie","Eau refroidie - MBTU",null,null,"MBTU",211,0.21099999999999999,0.15238888888888888,0.72222222222222221]
["Eau chaude","Eau chaude - MBTU",null,null,"MBTU",1318.7499999999998,1.3187499999999999,66.071672110055417,50.101741884402216]
["Vapeur","Vapeur - Lbs",null,null,"Lbs",1.5061428571428572,1.5061428571428572E-3,7.5460380669607516E-2,50.101741884402223]
[]
[]
["références:"]
[1,"Annexe 13 du Rapport d'inventaire national du Canada 1990-2010 partie 3"]
[2,"Règlement sur la déclaration obligatoire de certaines émission de contaminants dans l'atmosphère, Loi sur la qualité de l'environnement, Q-2, a.2.2, 109.1 et 124.1, tableau 1-3 Facteurs d’émission selon le type de combustible"]
[null,"Utilisation des données pour usages industriels, ciment, secteur manufacturier et secteurs résidentiel, commercial, isntitutionnel, agricile et de la construction (évacuation de centrale électrique, autoconsommation ou gazoduc)."]
[]
[null,41617]
[null,"Benoît Légaré, Nadia Lalancette et Michel Fournier, on convient de d'utiliser la valeur calculée à la colonne 18"]
[null,"Ces facteurs sont les mêmes que ceux utilisés dans le fichier CompilationSommaireV5"]
[3,"Facteur de conversion normalisé pour le gaz naturel au Québec, par Gaz Métro"]
[4,"MELS- ES"]
[null,"Ces facteurs sont les mêmes que ceux utilisés dans le fichier CompilationSommaireV5"]
[3,"Facteur de conversion normalisé pour le gaz naturel au Québec, par Gaz Métro"]
[4,"MELS- ES"]

{"sheet":"Validation","index":19,"n_rows":55,"n_cols":39,"rows_kept":55,"cut":false,"hidden":true,"merged":[[0,16,0,17],[0,1,0,3],[0,4,0,6],[0,7,0,8],[0,9,0,10],[0,11,0,12],[0,30,0,31],[0,32,0,33],[0,34,0,35],[0,36,0,37],[0,18,0,19],[0,20,0,21],[0,22,0,23],[0,24,0,25],[0,26,0,27],[0,28,0,29]]}
[null,"TOTAL",null,null,"Intensité énergétique",null,null,"GES",null,"Économie d'énergie",null,"Économie de coûts",null,"Économie de GES","Superficie","Nombre de bâtiments","Consommation électrique",null,"Gaz naturel",null,"Mazout n°2",null,"Mazout n°6",null,"Diesel génératrice",null,"Propane",null,"Résidus de bois\n (8 % d'humidité)",null,"Résidus de bois\n(35 % d'humidité)",null,"Vapeur",null,"Eau refroidie",null,"Eau chaude",null,"DJC"]
[null," [GJ réel]","[GJ 09-10 ajusté]","[$ réel]","[GJ réel/m²]","[GJ 09-10 ajusté/m²]","[$ réel/m²]","[T éq. CO2]","[kg éq. CO2/m²]","[GJ ajusté/m²]","[%]","[$ réel/m²]","[%]","[T éq. CO2]","[m²]",null," [kWh]"," [$]"," [m³]"," [$]"," [l]"," [$]"," [l]"," [$]"," [l]"," [$]"," [l]"," [$]"," [1000 kg MG]"," [$]"," [1000 kg MG]"," [$]","[lbs]"," [$]","[MBTU]"," [$]","[MBTU]"," [$]"," [° C]"]
["2009-2010",{"$f":"RÉSUMÉ!B10","v":0},{"$f":"RÉSUMÉ!C10","v":0},{"$f":"RÉSUMÉ!D10","v":0},{"$f":"RÉSUMÉ!E10","v":0},{"$f":"RÉSUMÉ!F10","v":0},{"$f":"RÉSUMÉ!G10","v":0},{"$f":"RÉSUMÉ!H10","v":0},{"$f":"RÉSUMÉ!I10","v":0},{"$f":"RÉSUMÉ!J10","v":0},{"$f":"RÉSUMÉ!K10","v":0},{"$f":"RÉSUMÉ!L10","v":0},{"$f":"RÉSUMÉ!M10","v":0},{"$f":"RÉSUMÉ!N10","v":0},{"$f":"RÉSUMÉ!O10","v":0},{"$f":"RÉSUMÉ!P10","v":0},{"$f":"RÉSUMÉ!Q10","v":0},{"$f":"RÉSUMÉ!R10","v":0},{"$f":"RÉSUMÉ!S10","v":0},{"$f":"RÉSUMÉ!T10","v":0},{"$f":"RÉSUMÉ!U10","v":0},{"$f":"RÉSUMÉ!V10","v":0},{"$f":"RÉSUMÉ!W10","v":0},{"$f":"RÉSUMÉ!X10","v":0},{"$f":"RÉSUMÉ!Y10","v":0},{"$f":"RÉSUMÉ!Z10","v":0},{"$f":"RÉSUMÉ!AA10","v":0},{"$f":"RÉSUMÉ!AB10","v":0},{"$f":"RÉSUMÉ!AC10","v":0},{"$f":"RÉSUMÉ!AD10","v":0},{"$f":"RÉSUMÉ!AE10","v":0},{"$f":"RÉSUMÉ!AF10","v":0},{"$f":"RÉSUMÉ!AG10","v":0},{"$f":"RÉSUMÉ!AH10","v":0},{"$f":"RÉSUMÉ!AI10","v":0},{"$f":"RÉSUMÉ!AJ10","v":0},{"$f":"RÉSUMÉ!AK10","v":0},{"$f":"RÉSUMÉ!AL10","v":0},{"$f":"RÉSUMÉ!AM10","v":3967.8000000000006}]
["2010-2011",{"$f":"RÉSUMÉ!B11","v":0},{"$f":"RÉSUMÉ!C11","v":0},{"$f":"RÉSUMÉ!D11","v":0},{"$f":"RÉSUMÉ!E11","v":0},{"$f":"RÉSUMÉ!F11","v":0},{"$f":"RÉSUMÉ!G11","v":0},{"$f":"RÉSUMÉ!H11","v":0},{"$f":"RÉSUMÉ!I11","v":0},{"$f":"RÉSUMÉ!J11","v":0},{"$f":"RÉSUMÉ!K11","v":0},{"$f":"RÉSUMÉ!L11","v":0},{"$f":"RÉSUMÉ!M11","v":0},{"$f":"RÉSUMÉ!N11","v":0},{"$f":"RÉSUMÉ!O11","v":0},{"$f":"RÉSUMÉ!P11","v":0},{"$f":"RÉSUMÉ!Q11","v":0},{"$f":"RÉSUMÉ!R11","v":0},{"$f":"RÉSUMÉ!S11","v":0},{"$f":"RÉSUMÉ!T11","v":0},{"$f":"RÉSUMÉ!U11","v":0},{"$f":"RÉSUMÉ!V11","v":0},{"$f":"RÉSUMÉ!W11","v":0},{"$f":"RÉSUMÉ!X11","v":0},{"$f":"RÉSUMÉ!Y11","v":0},{"$f":"RÉSUMÉ!Z11","v":0},{"$f":"RÉSUMÉ!AA11","v":0},{"$f":"RÉSUMÉ!AB11","v":0},{"$f":"RÉSUMÉ!AC11","v":0},{"$f":"RÉSUMÉ!AD11","v":0},{"$f":"RÉSUMÉ!AE11","v":0},{"$f":"RÉSUMÉ!AF11","v":0},{"$f":"RÉSUMÉ!AG11","v":0},{"$f":"RÉSUMÉ!AH11","v":0},{"$f":"RÉSUMÉ!AI11","v":0},{"$f":"RÉSUMÉ!AJ11","v":0},{"$f":"RÉSUMÉ!AK11","v":0},{"$f":"RÉSUMÉ!AL11","v":0},{"$f":"RÉSUMÉ!AM11","v":4187.3999999999996}]
["2011-2012",{"$f":"RÉSUMÉ!B12","v":0},{"$f":"RÉSUMÉ!C12","v":0},{"$f":"RÉSUMÉ!D12","v":0},{"$f":"RÉSUMÉ!E12","v":0},{"$f":"RÉSUMÉ!F12","v":0},{"$f":"RÉSUMÉ!G12","v":0},{"$f":"RÉSUMÉ!H12","v":0},{"$f":"RÉSUMÉ!I12","v":0},{"$f":"RÉSUMÉ!J12","v":0},{"$f":"RÉSUMÉ!K12","v":0},{"$f":"RÉSUMÉ!L12","v":0},{"$f":"RÉSUMÉ!M12","v":0},{"$f":"RÉSUMÉ!N12","v":0},{"$f":"RÉSUMÉ!O12","v":0},{"$f":"RÉSUMÉ!P12","v":0},{"$f":"RÉSUMÉ!Q12","v":0},{"$f":"RÉSUMÉ!R12","v":0},{"$f":"RÉSUMÉ!S12","v":0},{"$f":"RÉSUMÉ!T12","v":0},{"$f":"RÉSUMÉ!U12","v":0},{"$f":"RÉSUMÉ!V12","v":0},{"$f":"RÉSUMÉ!W12","v":0},{"$f":"RÉSUMÉ!X12","v":0},{"$f":"RÉSUMÉ!Y12","v":0},{"$f":"RÉSUMÉ!Z12","v":0},{"$f":"RÉSUMÉ!AA12","v":0},{"$f":"RÉSUMÉ!AB12","v":0},{"$f":"RÉSUMÉ!AC12","v":0},{"$f":"RÉSUMÉ!AD12","v":0},{"$f":"RÉSUMÉ!AE12","v":0},{"$f":"RÉSUMÉ!AF12","v":0},{"$f":"RÉSUMÉ!AG12","v":0},{"$f":"RÉSUMÉ!AH12","v":0},{"$f":"RÉSUMÉ!AI12","v":0},{"$f":"RÉSUMÉ!AJ12","v":0},{"$f":"RÉSUMÉ!AK12","v":0},{"$f":"RÉSUMÉ!AL12","v":0},{"$f":"RÉSUMÉ!AM12","v":3730}]
["2012-2013",{"$f":"RÉSUMÉ!B13","v":0},{"$f":"RÉSUMÉ!C13","v":0},{"$f":"RÉSUMÉ!D13","v":0},{"$f":"RÉSUMÉ!E13","v":0},{"$f":"RÉSUMÉ!F13","v":0},{"$f":"RÉSUMÉ!G13","v":0},{"$f":"RÉSUMÉ!H13","v":0},{"$f":"RÉSUMÉ!I13","v":0},{"$f":"RÉSUMÉ!J13","v":0},{"$f":"RÉSUMÉ!K13","v":0},{"$f":"RÉSUMÉ!L13","v":0},{"$f":"RÉSUMÉ!M13","v":0},{"$f":"RÉSUMÉ!N13","v":0},{"$f":"RÉSUMÉ!O13","v":0},{"$f":"RÉSUMÉ!P13","v":0},{"$f":"RÉSUMÉ!Q13","v":0},{"$f":"RÉSUMÉ!R13","v":0},{"$f":"RÉSUMÉ!S13","v":0},{"$f":"RÉSUMÉ!T13","v":0},{"$f":"RÉSUMÉ!U13","v":0},{"$f":"RÉSUMÉ!V13","v":0},{"$f":"RÉSUMÉ!W13","v":0},{"$f":"RÉSUMÉ!X13","v":0},{"$f":"RÉSUMÉ!Y13","v":0},{"$f":"RÉSUMÉ!Z13","v":0},{"$f":"RÉSUMÉ!AA13","v":0},{"$f":"RÉSUMÉ!AB13","v":0},{"$f":"RÉSUMÉ!AC13","v":0},{"$f":"RÉSUMÉ!AD13","v":0},{"$f":"RÉSUMÉ!AE13","v":0},{"$f":"RÉSUMÉ!AF13","v":0},{"$f":"RÉSUMÉ!AG13","v":0},{"$f":"RÉSUMÉ!AH13","v":0},{"$f":"RÉSUMÉ!AI13","v":0},{"$f":"RÉSUMÉ!AJ13","v":0},{"$f":"RÉSUMÉ!AK13","v":0},{"$f":"RÉSUMÉ!AL13","v":0},{"$f":"RÉSUMÉ!AM13","v":4039.4}]
["2013-2014",{"$f":"RÉSUMÉ!B14","v":0},{"$f":"RÉSUMÉ!C14","v":0},{"$f":"RÉSUMÉ!D14","v":0},{"$f":"RÉSUMÉ!E14","v":0},{"$f":"RÉSUMÉ!F14","v":0},{"$f":"RÉSUMÉ!G14","v":0},{"$f":"RÉSUMÉ!H14","v":0},{"$f":"RÉSUMÉ!I14","v":0},{"$f":"RÉSUMÉ!J14","v":0},{"$f":"RÉSUMÉ!K14","v":0},{"$f":"RÉSUMÉ!L14","v":0},{"$f":"RÉSUMÉ!M14","v":0},{"$f":"RÉSUMÉ!N14","v":0},{"$f":"RÉSUMÉ!O14","v":0},{"$f":"RÉSUMÉ!P14","v":0},{"$f":"RÉSUMÉ!Q14","v":0},{"$f":"RÉSUMÉ!R14","v":0},{"$f":"RÉSUMÉ!S14","v":0},{"$f":"RÉSUMÉ!T14","v":0},{"$f":"RÉSUMÉ!U14","v":0},{"$f":"RÉSUMÉ!V14","v":0},{"$f":"RÉSUMÉ!W14","v":0},{"$f":"RÉSUMÉ!X14","v":0},{"$f":"RÉSUMÉ!Y14","v":0},{"$f":"RÉSUMÉ!Z14","v":0},{"$f":"RÉSUMÉ!AA14","v":0},{"$f":"RÉSUMÉ!AB14","v":0},{"$f":"RÉSUMÉ!AC14","v":0},{"$f":"RÉSUMÉ!AD14","v":0},{"$f":"RÉSUMÉ!AE14","v":0},{"$f":"RÉSUMÉ!AF14","v":0},{"$f":"RÉSUMÉ!AG14","v":0},{"$f":"RÉSUMÉ!AH14","v":0},{"$f":"RÉSUMÉ!AI14","v":0},{"$f":"RÉSUMÉ!AJ14","v":0},{"$f":"RÉSUMÉ!AK14","v":0},{"$f":"RÉSUMÉ!AL14","v":0},{"$f":"RÉSUMÉ!AM14","v":4562.5}]
["2014-2015",{"$f":"RÉSUMÉ!B15","v":0},{"$f":"RÉSUMÉ!C15","v":0},{"$f":"RÉSUMÉ!D15","v":0},{"$f":"RÉSUMÉ!E15","v":0},{"$f":"RÉSUMÉ!F15","v":0},{"$f":"RÉSUMÉ!G15","v":0},{"$f":"RÉSUMÉ!H15","v":0},{"$f":"RÉSUMÉ!I15","v":0},{"$f":"RÉSUMÉ!J15","v":0},{"$f":"RÉSUMÉ!K15","v":0},{"$f":"RÉSUMÉ!L15","v":0},{"$f":"RÉSUMÉ!M15","v":0},{"$f":"RÉSUMÉ!N15","v":0},{"$f":"RÉSUMÉ!O15","v":0},{"$f":"RÉSUMÉ!P15","v":0},{"$f":"RÉSUMÉ!Q15","v":0},{"$f":"RÉSUMÉ!R15","v":0},{"$f":"RÉSUMÉ!S15","v":0},{"$f":"RÉSUMÉ!T15","v":0},{"$f":"RÉSUMÉ!U15","v":0},{"$f":"RÉSUMÉ!V15","v":0},{"$f":"RÉSUMÉ!W15","v":0},{"$f":"RÉSUMÉ!X15","v":0},{"$f":"RÉSUMÉ!Y15","v":0},{"$f":"RÉSUMÉ!Z15","v":0},{"$f":"RÉSUMÉ!AA15","v":0},{"$f":"RÉSUMÉ!AB15","v":0},{"$f":"RÉSUMÉ!AC15","v":0},{"$f":"RÉSUMÉ!AD15","v":0},{"$f":"RÉSUMÉ!AE15","v":0},{"$f":"RÉSUMÉ!AF15","v":0},{"$f":"RÉSUMÉ!AG15","v":0},{"$f":"RÉSUMÉ!AH15","v":0},{"$f":"RÉSUMÉ!AI15","v":0},{"$f":"RÉSUMÉ!AJ15","v":0},{"$f":"RÉSUMÉ!AK15","v":0},{"$f":"RÉSUMÉ!AL15","v":0},{"$f":"RÉSUMÉ!AM15","v":4543.1000000000004}]
["2015-2016",{"$f":"RÉSUMÉ!B16","v":0},{"$f":"RÉSUMÉ!C16","v":0},{"$f":"RÉSUMÉ!D16","v":0},{"$f":"RÉSUMÉ!E16","v":0},{"$f":"RÉSUMÉ!F16","v":0},{"$f":"RÉSUMÉ!G16","v":0},{"$f":"RÉSUMÉ!H16","v":0},{"$f":"RÉSUMÉ!I16","v":0},{"$f":"RÉSUMÉ!J16","v":0},{"$f":"RÉSUMÉ!K16","v":0},{"$f":"RÉSUMÉ!L16","v":0},{"$f":"RÉSUMÉ!M16","v":0},{"$f":"RÉSUMÉ!N16","v":0},{"$f":"RÉSUMÉ!O16","v":0},{"$f":"RÉSUMÉ!P16","v":0},{"$f":"RÉSUMÉ!Q16","v":0},{"$f":"RÉSUMÉ!R16","v":0},{"$f":"RÉSUMÉ!S16","v":0},{"$f":"RÉSUMÉ!T16","v":0},{"$f":"RÉSUMÉ!U16","v":0},{"$f":"RÉSUMÉ!V16","v":0},{"$f":"RÉSUMÉ!W16","v":0},{"$f":"RÉSUMÉ!X16","v":0},{"$f":"RÉSUMÉ!Y16","v":0},{"$f":"RÉSUMÉ!Z16","v":0},{"$f":"RÉSUMÉ!AA16","v":0},{"$f":"RÉSUMÉ!AB16","v":0},{"$f":"RÉSUMÉ!AC16","v":0},{"$f":"RÉSUMÉ!AD16","v":0},{"$f":"RÉSUMÉ!AE16","v":0},{"$f":"RÉSUMÉ!AF16","v":0},{"$f":"RÉSUMÉ!AG16","v":0},{"$f":"RÉSUMÉ!AH16","v":0},{"$f":"RÉSUMÉ!AI16","v":0},{"$f":"RÉSUMÉ!AJ16","v":0},{"$f":"RÉSUMÉ!AK16","v":0},{"$f":"RÉSUMÉ!AL16","v":0},{"$f":"RÉSUMÉ!AM16","v":3611.4000000000005}]
["2016-2017",{"$f":"RÉSUMÉ!B17","v":0},{"$f":"RÉSUMÉ!C17","v":0},{"$f":"RÉSUMÉ!D17","v":0},{"$f":"RÉSUMÉ!E17","v":0},{"$f":"RÉSUMÉ!F17","v":0},{"$f":"RÉSUMÉ!G17","v":0},{"$f":"RÉSUMÉ!H17","v":0},{"$f":"RÉSUMÉ!I17","v":0},{"$f":"RÉSUMÉ!J17","v":0},{"$f":"RÉSUMÉ!K17","v":0},{"$f":"RÉSUMÉ!L17","v":0},{"$f":"RÉSUMÉ!M17","v":0},{"$f":"RÉSUMÉ!N17","v":0},{"$f":"RÉSUMÉ!O17","v":0},{"$f":"RÉSUMÉ!P17","v":0},{"$f":"RÉSUMÉ!Q17","v":0},{"$f":"RÉSUMÉ!R17","v":0},{"$f":"RÉSUMÉ!S17","v":0},{"$f":"RÉSUMÉ!T17","v":0},{"$f":"RÉSUMÉ!U17","v":0},{"$f":"RÉSUMÉ!V17","v":0},{"$f":"RÉSUMÉ!W17","v":0},{"$f":"RÉSUMÉ!X17","v":0},{"$f":"RÉSUMÉ!Y17","v":0},{"$f":"RÉSUMÉ!Z17","v":0},{"$f":"RÉSUMÉ!AA17","v":0},{"$f":"RÉSUMÉ!AB17","v":0},{"$f":"RÉSUMÉ!AC17","v":0},{"$f":"RÉSUMÉ!AD17","v":0},{"$f":"RÉSUMÉ!AE17","v":0},{"$f":"RÉSUMÉ!AF17","v":0},{"$f":"RÉSUMÉ!AG17","v":0},{"$f":"RÉSUMÉ!AH17","v":0},{"$f":"RÉSUMÉ!AI17","v":0},{"$f":"RÉSUMÉ!AJ17","v":0},{"$f":"RÉSUMÉ!AK17","v":0},{"$f":"RÉSUMÉ!AL17","v":0},{"$f":"RÉSUMÉ!AM17","v":3951.9}]
["2017-2018",{"$f":"RÉSUMÉ!B18","v":0},{"$f":"RÉSUMÉ!C18","v":0},{"$f":"RÉSUMÉ!D18","v":0},{"$f":"RÉSUMÉ!E18","v":0},{"$f":"RÉSUMÉ!F18","v":0},{"$f":"RÉSUMÉ!G18","v":0},{"$f":"RÉSUMÉ!H18","v":0},{"$f":"RÉSUMÉ!I18","v":0},{"$f":"RÉSUMÉ!J18","v":0},{"$f":"RÉSUMÉ!K18","v":0},{"$f":"RÉSUMÉ!L18","v":0},{"$f":"RÉSUMÉ!M18","v":0},{"$f":"RÉSUMÉ!N18","v":0},{"$f":"RÉSUMÉ!O18","v":0},{"$f":"RÉSUMÉ!P18","v":0},{"$f":"RÉSUMÉ!Q18","v":0},{"$f":"RÉSUMÉ!R18","v":0},{"$f":"RÉSUMÉ!S18","v":0},{"$f":"RÉSUMÉ!T18","v":0},{"$f":"RÉSUMÉ!U18","v":0},{"$f":"RÉSUMÉ!V18","v":0},{"$f":"RÉSUMÉ!W18","v":0},{"$f":"RÉSUMÉ!X18","v":0},{"$f":"RÉSUMÉ!Y18","v":0},{"$f":"RÉSUMÉ!Z18","v":0},{"$f":"RÉSUMÉ!AA18","v":0},{"$f":"RÉSUMÉ!AB18","v":0},{"$f":"RÉSUMÉ!AC18","v":0},{"$f":"RÉSUMÉ!AD18","v":0},{"$f":"RÉSUMÉ!AE18","v":0},{"$f":"RÉSUMÉ!AF18","v":0},{"$f":"RÉSUMÉ!AG18","v":0},{"$f":"RÉSUMÉ!AH18","v":0},{"$f":"RÉSUMÉ!AI18","v":0},{"$f":"RÉSUMÉ!AJ18","v":0},{"$f":"RÉSUMÉ!AK18","v":0},{"$f":"RÉSUMÉ!AL18","v":0},{"$f":"RÉSUMÉ!AM18","v":3949.4000000000005}]
["2018-2019",{"$f":"RÉSUMÉ!B19","v":0},{"$f":"RÉSUMÉ!C19","v":0},{"$f":"RÉSUMÉ!D19","v":0},{"$f":"RÉSUMÉ!E19","v":0},{"$f":"RÉSUMÉ!F19","v":0},{"$f":"RÉSUMÉ!G19","v":0},{"$f":"RÉSUMÉ!H19","v":0},{"$f":"RÉSUMÉ!I19","v":0},{"$f":"RÉSUMÉ!J19","v":0},{"$f":"RÉSUMÉ!K19","v":0},{"$f":"RÉSUMÉ!L19","v":0},{"$f":"RÉSUMÉ!M19","v":0},{"$f":"RÉSUMÉ!N19","v":0},{"$f":"RÉSUMÉ!O19","v":0},{"$f":"RÉSUMÉ!P19","v":0},{"$f":"RÉSUMÉ!Q19","v":0},{"$f":"RÉSUMÉ!R19","v":0},{"$f":"RÉSUMÉ!S19","v":0},{"$f":"RÉSUMÉ!T19","v":0},{"$f":"RÉSUMÉ!U19","v":0},{"$f":"RÉSUMÉ!V19","v":0},{"$f":"RÉSUMÉ!W19","v":0},{"$f":"RÉSUMÉ!X19","v":0},{"$f":"RÉSUMÉ!Y19","v":0},{"$f":"RÉSUMÉ!Z19","v":0},{"$f":"RÉSUMÉ!AA19","v":0},{"$f":"RÉSUMÉ!AB19","v":0},{"$f":"RÉSUMÉ!AC19","v":0},{"$f":"RÉSUMÉ!AD19","v":0},{"$f":"RÉSUMÉ!AE19","v":0},{"$f":"RÉSUMÉ!AF19","v":0},{"$f":"RÉSUMÉ!AG19","v":0},{"$f":"RÉSUMÉ!AH19","v":0},{"$f":"RÉSUMÉ!AI19","v":0},{"$f":"RÉSUMÉ!AJ19","v":0},{"$f":"RÉSUMÉ!AK19","v":0},{"$f":"RÉSUMÉ!AL19","v":0},{"$f":"RÉSUMÉ!AM19","v":4347.2000000000007}]
["2019-2020",{"$f":"RÉSUMÉ!B20","v":0},{"$f":"RÉSUMÉ!C20","v":0},{"$f":"RÉSUMÉ!D20","v":0},{"$f":"RÉSUMÉ!E20","v":0},{"$f":"RÉSUMÉ!F20","v":0},{"$f":"RÉSUMÉ!G20","v":0},{"$f":"RÉSUMÉ!H20","v":0},{"$f":"RÉSUMÉ!I20","v":0},{"$f":"RÉSUMÉ!J20","v":0},{"$f":"RÉSUMÉ!K20","v":0},{"$f":"RÉSUMÉ!L20","v":0},{"$f":"RÉSUMÉ!M20","v":0},{"$f":"RÉSUMÉ!N20","v":0},{"$f":"RÉSUMÉ!O20","v":0},{"$f":"RÉSUMÉ!P20","v":0},{"$f":"RÉSUMÉ!Q20","v":0},{"$f":"RÉSUMÉ!R20","v":0},{"$f":"RÉSUMÉ!S20","v":0},{"$f":"RÉSUMÉ!T20","v":0},{"$f":"RÉSUMÉ!U20","v":0},{"$f":"RÉSUMÉ!V20","v":0},{"$f":"RÉSUMÉ!W20","v":0},{"$f":"RÉSUMÉ!X20","v":0},{"$f":"RÉSUMÉ!Y20","v":0},{"$f":"RÉSUMÉ!Z20","v":0},{"$f":"RÉSUMÉ!AA20","v":0},{"$f":"RÉSUMÉ!AB20","v":0},{"$f":"RÉSUMÉ!AC20","v":0},{"$f":"RÉSUMÉ!AD20","v":0},{"$f":"RÉSUMÉ!AE20","v":0},{"$f":"RÉSUMÉ!AF20","v":0},{"$f":"RÉSUMÉ!AG20","v":0},{"$f":"RÉSUMÉ!AH20","v":0},{"$f":"RÉSUMÉ!AI20","v":0},{"$f":"RÉSUMÉ!AJ20","v":0},{"$f":"RÉSUMÉ!AK20","v":0},{"$f":"RÉSUMÉ!AL20","v":0},{"$f":"RÉSUMÉ!AM20","v":4105.7}]
["2020-2021",{"$f":"RÉSUMÉ!B21","v":0},{"$f":"RÉSUMÉ!C21","v":0},{"$f":"RÉSUMÉ!D21","v":0},{"$f":"RÉSUMÉ!E21","v":0},{"$f":"RÉSUMÉ!F21","v":0},{"$f":"RÉSUMÉ!G21","v":0},{"$f":"RÉSUMÉ!H21","v":{"$error":"#NAME?"}},{"$f":"RÉSUMÉ!I21","v":0},{"$f":"RÉSUMÉ!J21","v":0},{"$f":"RÉSUMÉ!K21","v":0},{"$f":"RÉSUMÉ!L21","v":0},{"$f":"RÉSUMÉ!M21","v":0},{"$f":"RÉSUMÉ!N21","v":{"$error":"#NAME?"}},{"$f":"RÉSUMÉ!O21","v":0},{"$f":"RÉSUMÉ!P21","v":0},{"$f":"RÉSUMÉ!Q21","v":0},{"$f":"RÉSUMÉ!R21","v":0},{"$f":"RÉSUMÉ!S21","v":0},{"$f":"RÉSUMÉ!T21","v":0},{"$f":"RÉSUMÉ!U21","v":0},{"$f":"RÉSUMÉ!V21","v":0},{"$f":"RÉSUMÉ!W21","v":0},{"$f":"RÉSUMÉ!X21","v":0},{"$f":"RÉSUMÉ!Y21","v":0},{"$f":"RÉSUMÉ!Z21","v":0},{"$f":"RÉSUMÉ!AA21","v":0},{"$f":"RÉSUMÉ!AB21","v":0},{"$f":"RÉSUMÉ!AC21","v":0},{"$f":"RÉSUMÉ!AD21","v":0},{"$f":"RÉSUMÉ!AE21","v":0},{"$f":"RÉSUMÉ!AF21","v":0},{"$f":"RÉSUMÉ!AG21","v":0},{"$f":"RÉSUMÉ!AH21","v":0},{"$f":"RÉSUMÉ!AI21","v":0},{"$f":"RÉSUMÉ!AJ21","v":0},{"$f":"RÉSUMÉ!AK21","v":0},{"$f":"RÉSUMÉ!AL21","v":0},{"$f":"RÉSUMÉ!AM21","v":998.40000000000009}]
[]
[]
[]
[]
[]
[]
[]
[]
[]
[]
[]
[{"$f":"VLOOKUP($C$30,$A$3:$AM$14,1,FALSE)","v":{"$error":"#N/A"}},{"$f":"VLOOKUP($C$30,$A$3:$AM$14,2,FALSE)","v":{"$error":"#N/A"}},{"$f":"VLOOKUP($C$30,$A$3:$AM$14,3,FALSE)","v":{"$error":"#N/A"}},{"$f":"VLOOKUP($C$30,$A$3:$AM$14,4,FALSE)","v":{"$error":"#N/A"}},{"$f":"VLOOKUP($C$30,$A$3:$AM$14,5,FALSE)","v":{"$error":"#N/A"}},{"$f":"VLOOKUP($C$30,$A$3:$AM$14,6,FALSE)","v":{"$error":"#N/A"}},{"$f":"VLOOKUP($C$30,$A$3:$AM$14,7,FALSE)","v":{"$error":"#N/A"}},{"$f":"VLOOKUP($C$30,$A$3:$AM$14,8,FALSE)","v":{"$error":"#N/A"}},{"$f":"VLOOKUP($C$30,$A$3:$AM$14,9,FALSE)","v":{"$error":"#N/A"}},{"$f":"VLOOKUP($C$30,$A$3:$AM$14,10,FALSE)","v":{"$error":"#N/A"}},{"$f":"VLOOKUP($C$30,$A$3:$AM$14,11,FALSE)","v":{"$error":"#N/A"}},{"$f":"VLOOKUP($C$30,$A$3:$AM$14,12,FALSE)","v":{"$error":"#N/A"}},{"$f":"VLOOKUP($C$30,$A$3:$AM$14,13,FALSE)","v":{"$error":"#N/A"}},{"$f":"VLOOKUP($C$30,$A$3:$AM$14,14,FALSE)","v":{"$error":"#N/A"}},{"$f":"VLOOKUP($C$30,$A$3:$AM$14,15,FALSE)","v":{"$error":"#N/A"}},{"$f":"VLOOKUP($C$30,$A$3:$AM$14,16,FALSE)","v":{"$error":"#N/A"}},{"$f":"VLOOKUP($C$30,$A$3:$AM$14,17,FALSE)","v":{"$error":"#N/A"}},{"$f":"VLOOKUP($C$30,$A$3:$AM$14,18,FALSE)","v":{"$error":"#N/A"}},{"$f":"VLOOKUP($C$30,$A$3:$AM$14,19,FALSE)","v":{"$error":"#N/A"}},{"$f":"VLOOKUP($C$30,$A$3:$AM$14,20,FALSE)","v":{"$error":"#N/A"}},{"$f":"VLOOKUP($C$30,$A$3:$AM$14,21,FALSE)","v":{"$error":"#N/A"}},{"$f":"VLOOKUP($C$30,$A$3:$AM$14,22,FALSE)","v":{"$error":"#N/A"}},{"$f":"VLOOKUP($C$30,$A$3:$AM$14,23,FALSE)","v":{"$error":"#N/A"}},{"$f":"VLOOKUP($C$30,$A$3:$AM$14,24,FALSE)","v":{"$error":"#N/A"}},{"$f":"VLOOKUP($C$30,$A$3:$AM$14,25,FALSE)","v":{"$error":"#N/A"}},{"$f":"VLOOKUP($C$30,$A$3:$AM$14,26,FALSE)","v":{"$error":"#N/A"}},{"$f":"VLOOKUP($C$30,$A$3:$AM$14,27,FALSE)","v":{"$error":"#N/A"}},{"$f":"VLOOKUP($C$30,$A$3:$AM$14,28,FALSE)","v":{"$error":"#N/A"}},{"$f":"VLOOKUP($C$30,$A$3:$AM$14,29,FALSE)","v":{"$error":"#N/A"}},{"$f":"VLOOKUP($C$30,$A$3:$AM$14,30,FALSE)","v":{"$error":"#N/A"}},{"$f":"VLOOKUP($C$30,$A$3:$AM$14,31,FALSE)","v":{"$error":"#N/A"}},{"$f":"VLOOKUP($C$30,$A$3:$AM$14,32,FALSE)","v":{"$error":"#N/A"}},{"$f":"VLOOKUP($C$30,$A$3:$AM$14,33,FALSE)","v":{"$error":"#N/A"}},{"$f":"VLOOKUP($C$30,$A$3:$AM$14,34,FALSE)","v":{"$error":"#N/A"}},{"$f":"VLOOKUP($C$30,$A$3:$AM$14,35,FALSE)","v":{"$error":"#N/A"}},{"$f":"VLOOKUP($C$30,$A$3:$AM$14,36,FALSE)","v":{"$error":"#N/A"}},{"$f":"VLOOKUP($C$30,$A$3:$AM$14,37,FALSE)","v":{"$error":"#N/A"}},{"$f":"VLOOKUP($C$30,$A$3:$AM$14,38,FALSE)","v":{"$error":"#N/A"}},{"$f":"VLOOKUP($C$30,$A$3:$AM$14,39,FALSE)","v":{"$error":"#N/A"}}]
[{"$f":"VLOOKUP($C$31,$A$3:$AM$14,1,FALSE)","v":{"$error":"#VALUE!"}},{"$f":"VLOOKUP($C$31,$A$3:$AM$14,2,FALSE)","v":{"$error":"#VALUE!"}},{"$f":"VLOOKUP($C$31,$A$3:$AM$14,3,FALSE)","v":{"$error":"#VALUE!"}},{"$f":"VLOOKUP($C$31,$A$3:$AM$14,4,FALSE)","v":{"$error":"#VALUE!"}},{"$f":"VLOOKUP($C$31,$A$3:$AM$14,5,FALSE)","v":{"$error":"#VALUE!"}},{"$f":"VLOOKUP($C$31,$A$3:$AM$14,6,FALSE)","v":{"$error":"#VALUE!"}},{"$f":"VLOOKUP($C$31,$A$3:$AM$14,7,FALSE)","v":{"$error":"#VALUE!"}},{"$f":"VLOOKUP($C$31,$A$3:$AM$14,8,FALSE)","v":{"$error":"#VALUE!"}},{"$f":"VLOOKUP($C$31,$A$3:$AM$14,9,FALSE)","v":{"$error":"#VALUE!"}},{"$f":"VLOOKUP($C$31,$A$3:$AM$14,10,FALSE)","v":{"$error":"#VALUE!"}},{"$f":"VLOOKUP($C$31,$A$3:$AM$14,11,FALSE)","v":{"$error":"#VALUE!"}},{"$f":"VLOOKUP($C$31,$A$3:$AM$14,12,FALSE)","v":{"$error":"#VALUE!"}},{"$f":"VLOOKUP($C$31,$A$3:$AM$14,13,FALSE)","v":{"$error":"#VALUE!"}},{"$f":"VLOOKUP($C$31,$A$3:$AM$14,14,FALSE)","v":{"$error":"#VALUE!"}},{"$f":"VLOOKUP($C$31,$A$3:$AM$14,15,FALSE)","v":{"$error":"#VALUE!"}},{"$f":"VLOOKUP($C$31,$A$3:$AM$14,16,FALSE)","v":{"$error":"#VALUE!"}},{"$f":"VLOOKUP($C$31,$A$3:$AM$14,17,FALSE)","v":{"$error":"#VALUE!"}},{"$f":"VLOOKUP($C$31,$A$3:$AM$14,18,FALSE)","v":{"$error":"#VALUE!"}},{"$f":"VLOOKUP($C$31,$A$3:$AM$14,19,FALSE)","v":{"$error":"#VALUE!"}},{"$f":"VLOOKUP($C$31,$A$3:$AM$14,20,FALSE)","v":{"$error":"#VALUE!"}},{"$f":"VLOOKUP($C$31,$A$3:$AM$14,21,FALSE)","v":{"$error":"#VALUE!"}},{"$f":"VLOOKUP($C$31,$A$3:$AM$14,22,FALSE)","v":{"$error":"#VALUE!"}},{"$f":"VLOOKUP($C$31,$A$3:$AM$14,23,FALSE)","v":{"$error":"#VALUE!"}},{"$f":"VLOOKUP($C$31,$A$3:$AM$14,24,FALSE)","v":{"$error":"#VALUE!"}},{"$f":"VLOOKUP($C$31,$A$3:$AM$14,25,FALSE)","v":{"$error":"#VALUE!"}},{"$f":"VLOOKUP($C$31,$A$3:$AM$14,26,FALSE)","v":{"$error":"#VALUE!"}},{"$f":"VLOOKUP($C$31,$A$3:$AM$14,27,FALSE)","v":{"$error":"#VALUE!"}},{"$f":"VLOOKUP($C$31,$A$3:$AM$14,28,FALSE)","v":{"$error":"#VALUE!"}},{"$f":"VLOOKUP($C$31,$A$3:$AM$14,29,FALSE)","v":{"$error":"#VALUE!"}},{"$f":"VLOOKUP($C$31,$A$3:$AM$14,30,FALSE)","v":{"$error":"#VALUE!"}},{"$f":"VLOOKUP($C$31,$A$3:$AM$14,31,FALSE)","v":{"$error":"#VALUE!"}},{"$f":"VLOOKUP($C$31,$A$3:$AM$14,32,FALSE)","v":{"$error":"#VALUE!"}},{"$f":"VLOOKUP($C$31,$A$3:$AM$14,33,FALSE)","v":{"$error":"#VALUE!"}},{"$f":"VLOOKUP($C$31,$A$3:$AM$14,34,FALSE)","v":{"$error":"#VALUE!"}},{"$f":"VLOOKUP($C$31,$A$3:$AM$14,35,FALSE)","v":{"$error":"#VALUE!"}},{"$f":"VLOOKUP($C$31,$A$3:$AM$14,36,FALSE)","v":{"$error":"#VALUE!"}},{"$f":"VLOOKUP($C$31,$A$3:$AM$14,37,FALSE)","v":{"$error":"#VALUE!"}},{"$f":"VLOOKUP($C$31,$A$3:$AM$14,38,FALSE)","v":{"$error":"#VALUE!"}},{"$f":"VLOOKUP($C$31,$A$3:$AM$14,39,FALSE)","v":{"$error":"#VALUE!"}}]
[]
[]
["L'année choisie lors de l'importation va ici:","Année courante",null,null,null,null,"Calculs:",null,{"$f":"IF(C30=\"2016-2017\", \"OUI\",\"NON\")","v":"NON"},"Résultats possibles que peut lire la macro: \"OUI\", \"NON\". La formule de validation peut donc seulement avoir ces deux valeurs comme résultats et à cette cellule:"]
[null,"Année précédente",{"$f":"CONCATENATE((LEFT(C30,4)-1),\"-\",(RIGHT(C30,4)-1))","v":{"$error":"#VALUE!"}}]
[null,"Marge",0.85,1.1499999999999999]
[]
[]
[null,"Rapport de validation - Bâtiments",null,null,null,null,{"$f":"'1. IDENTITÉ'!B11","v":""},{"$f":"'1. IDENTITÉ'!B10","v":"NOM DE L'ENTITÉ"}]
[null,"Émis le :",{"$f":"TODAY()","v":"2021-02-09"}]
[]
[null,null,null,{"$f":"C31","v":{"$error":"#VALUE!"}},null,{"$f":"C30","v":0}]
[]
[null,"Superficie",null,{"$f":"O27","v":{"$error":"#VALUE!"}},"→",{"$f":"O26","v":{"$error":"#N/A"}}]
[null,"Nombre de bâtiments",null,{"$f":"P27","v":{"$error":"#VALUE!"}},"→",{"$f":"P26","v":{"$error":"#N/A"}}]
[]
[null,"Données électricité",null,{"$f":"Q27","v":{"$error":"#VALUE!"}},"→",{"$f":"Q26","v":{"$error":"#N/A"}},null,{"$f":"IFERROR(IF(OR(COUNTA(Q26:R26)= 0,SUM(Q26:R26)= 0),\"X\",\"✓\"), \"X\")","v":"X"}]
[]
[]
[]
[]
[]
[]
[]
[null,"Balises"]
[null,"Minimum",{"$f":"Lim_bas","v":0}]
[null,"Maximum",{"$f":"Lim_haut","v":0}]
[]
[null,"Coûts unitaires",null,null,null,null,null,"si(ET(( );))"]